program: Gaussian 09
title: 000262266
version: EM64L-G09RevD.01
frameworkgroup: C1[X(C13H10N2O5)]
method: RPBEPBE
basis: SDD
operation: Freq
keyword: #p
keyword: freq=noraman
keyword: PBEPBE/SDD
title: #p freq=noraman PBEPBE/SDD
converged: YES YES NO NO
title: Mulliken charges:
elementType: O O O O O N N C C C C C C C C C C C C C H H H H H H H H H H
charge: -0.229959 -0.186173 -0.176614 -0.203900 -0.196556 0.015647 0.021155 0.288562 -0.417719 0.409132 0.272304 -0.274227 -0.478388 0.427476 -0.390406 -0.410486 -0.387477 -0.223090 -0.218034 -0.234522 0.234964 0.237687 0.273988 0.332133 0.294127 0.227482 0.294169 0.230738 0.234780 0.233208
chargesum: 0.00000
title: Mulliken charges with hydrogens summed into heavy atoms:
elementType: O O O O O N N C C C C C C C C C C C C C
charge: -0.229959 -0.186173 -0.176614 -0.203900 -0.196556 0.015647 0.021155 0.288562 0.054933 0.409132 0.272304 -0.000239 -0.146256 0.427476 -0.096279 -0.183004 -0.093308 0.007647 0.016746 -0.001314
polarizability: 2.93319820e+02 -8.82050383e+00 1.89266079e+02 3.54017931e-01 -5.35071690e+00 7.76235160e+01
1716.lowfreq: -0.0005 0.0004 0.0005 0.6635 4.5408 7.0597 25.5060 29.1546 44.0634
frequency: 25.3636 29.1265 44.0503 57.1261 60.3358 87.6807 113.0551 141.0522 155.8298 163.2124 208.6640 232.0987 294.6441 308.5609 342.2583 372.4097 402.6335 413.1329 448.6885 474.4839 500.1352 519.8149 561.4561 598.3569 615.7836 637.8594 656.0075 675.3780 704.0750 710.3593 744.3867 748.0969 755.9850 777.3993 820.6731 829.9210 859.7983 877.2029 919.1668 952.2375 955.4391 983.6549 985.1481 989.3266 1000.0326 1014.6811 1028.7742 1056.5195 1089.0907 1114.7689 1149.3664 1175.2268 1193.0465 1199.5811 1203.6143 1215.9422 1225.6079 1252.8975 1270.0191 1320.5176 1354.2927 1360.0300 1372.4035 1389.0701 1398.7709 1432.7113 1441.7909 1459.4628 1481.7395 1488.1031 1583.0996 1596.3208 1612.1537 1618.2413 2955.8951 3022.1542 3113.6080 3132.7238 3146.2012 3160.6692 3171.6116 3173.2900 3188.2466 3190.5251
redmass: 6.7556 4.5676 7.4829 12.6802 9.6474 4.4974 5.9747 8.9316 5.5342 8.2698 6.1588 3.2668 8.0699 7.6948 9.1429 8.8880 2.8556 4.8568 3.8623 3.4467 7.2964 4.4643 5.7822 6.0131 6.5246 7.4805 7.5441 8.9624 2.2674 6.8162 1.4358 4.4961 11.5683 6.4570 3.9981 1.5678 1.2509 8.1798 1.3218 5.8226 1.5774 1.4093 1.3626 5.4694 1.4535 1.5502 2.1897 2.1383 1.5854 4.9335 1.3027 1.0538 1.1222 1.2982 8.7755 4.6209 2.0816 2.2132 2.1603 1.4303 1.9487 3.6942 11.6707 4.9448 7.6532 5.8845 2.1198 1.2989 2.2027 2.2648 8.8382 6.1488 7.0828 5.9363 1.0564 1.1055 1.0884 1.0869 1.0923 1.0963 1.1001 1.0883 1.0928 1.0965
irintensity: 0.5138 0.9142 0.6059 0.2266 0.9134 0.8037 6.0971 4.8101 4.1977 0.4412 0.8281 4.4231 0.4598 0.5626 0.7571 0.8013 1.4260 0.7700 5.2785 6.6033 3.3667 6.2603 0.9853 1.4102 0.0386 14.0050 21.2364 33.1086 31.6293 10.4638 75.7160 5.5059 12.7258 1.7379 5.9831 41.8119 0.4075 9.5639 6.5742 141.9149 31.0640 0.8912 0.5802 0.1432 1.3321 1.9592 8.2835 59.1718 9.8683 5.5717 65.7302 0.0726 12.9336 5.5777 342.6409 299.9417 38.8717 231.1335 122.4187 9.4481 18.9882 78.4383 88.8433 7.3705 84.5149 16.2148 17.8004 74.2754 42.5142 36.7932 29.3362 5.1457 242.9826 0.3764 20.6543 19.4203 9.9066 1.9139 23.1761 15.4327 19.9201 2.4523 12.0441 11.2741
temp: 298.150 k
press: 1.00000 atm
elementType: 8 8 8 8 8 7 7 6 6 6 6 6 6 6 6 6 6 6 6 6 1 1 1 1 1 1 1 1 1 1
symmnumber: 1
zpe: 556890.8 jmol-1
zpe.correction: 0.212109 hartree
zpe.thermalcorrener: 0.229140 hartree
zpe.thermalcorrenthalpy: 0.230084 hartree
zpe.thermalcorrgfe: 0.164461 hartree
zpe.sumelectzpe: -985.400301 hartree
zpe.sumelectthermal: -985.383270 hartree
zpe.sumelectthermalent: -985.382326 hartree
zpe.sumelectthermalfe: -985.447949 hartree
dipole: -5.4652 -5.1332 -0.3461
dipole: 7.5058
quadrupole: -134.2714 -116.0290 -116.4612
quadrupole: 4.5268 -1.4289 -4.1881
quadrupole: -12.0175 6.2249 5.7926 4.5268 -1.4289 -4.1881
hfenergy: -985.6124097 hartree
pointgroup: C01 [X(C13H10N2O5)]
dipole: -2.032182 1.6445827 -1.3732608 debye
polarizability: 293.1599934|10.9216955|138.1157022|8.3806519|-55.1136048|128.9337196 unknown
InChI: InChI=1S/C13H10N2O5/c16-14(17)11-6-7-13(12(8-11)15(18)19)20-9-10-4-2-1-3-5-10/h1-8H,9H2
charge 0 multiplicity 1
30 atoms
O  -0.751315 0.032302 -0.117164
O  1.40765 -2.844337 1.705948
O  -0.432539 -1.543793 2.058224
O  5.450265 1.531707 -0.435721
O  5.521358 -0.301578 0.925537
N  0.728279 -1.757565 1.543721
N  4.885737 0.566578 0.212744
C  0.600885 0.240342 -0.035329
C  -1.606079 1.012277 -0.834148
C  -3.050186 0.607198 -0.614656
C  1.36931 -0.677757 0.752273
C  1.293679 1.277522 -0.722556
C  2.768585 -0.589964 0.819231
C  3.414527 0.453048 0.130522
C  2.688375 1.391188 -0.636988
C  -4.02927 1.017469 -1.552572
C  -3.438344 -0.130418 0.530577
C  -5.391139 0.708023 -1.340588
C  -4.800434 -0.446733 0.732811
C  -5.780001 -0.025192 -0.195726
H  -1.345504 1.011254 -1.910936
H  -1.400439 2.018282 -0.412696
H  0.738714 1.991069 -1.335936
H  3.342368 -1.315383 1.401795
H  3.22942 2.185427 -1.158014
H  -3.733603 1.576141 -2.450036
H  -2.675345 -0.46993 1.237774
H  -6.142884 1.029251 -2.069797
H  -5.095049 -1.0251 1.615266
H  -6.835018 -0.27183 -0.033458
