program: Gaussian 09
title: 000026612
version: EM64L-G09RevD.01
frameworkgroup: C1[X(C10H20O3)]
method: RPBEPBE
basis: SDD
operation: Freq
keyword: #pfreq=noraman
keyword: PBEPBE/SDD
title: #p freq=noraman PBEPBE/SDD
converged: YES YES NO NO
title: Mulliken charges:
elementType: O O O C C C C C C C C C C H H H H H H H H H H H H H H H H H H H H
charge: -0.470038 -0.403733 -0.262190 -0.378353 -0.380357 -0.406173 -0.374545 -0.045392 -0.352754 -0.356784 -0.520613 -0.696797 0.198453 0.180318 0.241774 0.184359 0.195505 0.190932 0.210855 0.188056 0.194452 0.195681 0.188363 0.185600 0.194182 0.196051 0.268510 0.251504 0.208952 0.209861 0.214825 0.368126 0.381372
chargesum: 0.00000
title: Mulliken charges with hydrogens summed into heavy atoms:
elementType: O O O C C C C C C C C C C
charge: -0.101913 -0.022362 -0.262190 0.043739 -0.000493 -0.004385 0.007963 0.150289 0.021209 0.033448 -0.000599 -0.063158 0.198453
polarizability: 1.58671231e+02 1.34451333e+00 1.08464868e+02 2.92192943e+00 -1.14006813e+00 9.21289250e+01
1716.lowfreq: -17.3931 -1.8105 0.0001 0.0006 0.0008 11.3170 18.8160 32.2138 40.6128
frequency: 16.6997 31.9544 40.5679 53.0786 68.1717 92.1256 102.7537 124.5064 143.3391 148.9164 185.4861 198.9111 230.6465 280.1663 337.2848 351.3351 401.3083 439.7268 477.4147 499.5846 543.4271 567.5297 622.7802 668.3873 720.8991 729.5233 757.7001 810.3890 841.0602 863.9172 887.6922 895.2678 961.6237 993.0342 1005.6197 1011.6692 1036.1780 1055.5781 1063.3187 1073.8821 1081.8786 1083.3545 1113.9911 1127.5313 1185.5979 1197.2230 1218.9414 1229.7575 1238.6928 1260.1045 1268.5427 1280.5155 1285.3813 1293.3438 1296.6647 1309.2411 1329.8774 1341.1061 1349.6018 1353.4223 1360.6452 1386.2326 1398.9028 1414.3284 1446.1324 1460.7325 1460.8808 1467.5626 1475.2662 1476.5369 1483.1070 1487.9202 1640.5992 2931.8196 2946.9501 2949.3854 2955.9773 2961.5511 2966.2063 2967.9147 2970.8301 2984.3769 2994.3805 2994.5634 3013.1757 3021.8582 3033.6041 3055.4424 3065.2115 3067.7797 3069.7288 3472.9448 3502.4134
redmass: 3.0684 2.8339 4.3581 3.3952 3.7793 2.1375 2.4369 3.2043 1.8399 2.5084 4.7543 4.2702 1.1108 3.7458 6.3843 3.5674 3.2520 2.0828 2.5856 2.4420 2.9762 1.0617 2.3649 1.8070 1.0620 1.0950 1.1949 1.4925 2.2698 4.8538 1.9056 1.3344 1.5246 3.8539 2.2298 1.7896 2.7517 2.5088 2.5423 2.2926 2.3480 2.1319 1.6300 2.5547 1.6159 1.3163 1.3036 1.3453 1.4238 1.2504 1.2864 1.0293 1.1906 1.0797 1.1565 1.3106 1.2882 1.4594 1.7988 1.6936 1.6688 1.2172 1.6865 1.1235 1.0846 1.0652 1.0760 1.0733 1.0757 1.0453 1.0852 1.0904 7.6625 1.0837 1.0589 1.0587 1.0599 1.0636 1.0593 1.0619 1.0363 1.0958 1.0895 1.0710 1.1011 1.0984 1.1045 1.1014 1.0973 1.1007 1.0993 1.0652 1.0638
irintensity: 0.2773 0.3070 0.3349 1.0959 0.5260 0.2210 0.8185 1.0296 0.3399 0.7967 0.6261 1.4558 0.0013 1.7405 4.4127 5.1014 3.9115 8.6354 9.2108 12.0528 58.2769 190.6998 58.9078 102.1536 13.3668 0.2687 1.1695 11.3692 10.6829 0.5171 4.9634 0.4984 10.2373 4.5622 2.1187 8.8551 14.4835 158.0768 12.5747 122.2668 10.9558 40.8201 2.0762 22.8263 0.8708 0.8329 18.5038 9.2911 6.8233 22.4924 1.5176 1.1232 15.9262 1.1063 1.1666 7.2807 8.1297 18.1606 35.3442 4.1558 24.8129 10.4514 52.8379 29.9098 8.2646 0.1872 0.0690 0.9948 2.1469 11.5085 3.4561 26.0198 195.2141 44.4053 3.8184 1.2268 16.2441 7.4169 20.1191 163.7329 37.9273 5.7718 2.4613 11.9013 5.2351 22.2540 59.0351 74.8428 22.0418 104.9524 55.3405 61.8952 17.6996
temp: 298.150 k
press: 1.00000 atm
elementType: 8 8 8 6 6 6 6 6 6 6 6 6 6 1 1 1 1 1 1 1 1 1 1 1 1 1 1 1 1 1 1 1 1
symmnumber: 1
zpe: 754025.3 jmol-1
zpe.correction: 0.287193 hartree
zpe.thermalcorrener: 0.303551 hartree
zpe.thermalcorrenthalpy: 0.304495 hartree
zpe.thermalcorrgfe: 0.240403 hartree
zpe.sumelectzpe: -617.665906 hartree
zpe.sumelectthermal: -617.649549 hartree
zpe.sumelectthermalent: -617.648604 hartree
zpe.sumelectthermalfe: -617.712696 hartree
dipole: -1.3010 -2.0990 -0.9214
dipole: 2.6358
quadrupole: -69.7156 -86.0733 -81.1335
quadrupole: 5.4262 1.8557 -0.5290
quadrupole: 9.2585 -7.0991 -2.1594 5.4262 1.8557 -0.5290
hfenergy: -617.9530994 hartree
pointgroup: C01 [X(C10H20O3)]
dipole: -0.515282 0.7542403 0.4908958 debye
polarizability: 158.6981447|-0.7555655|108.3915836|-2.8396362|1.5533357|92.175295 unknown
InChI: InChI=1S/C10H20O3/c1-2-3-4-5-6-7-9(11)8-10(12)13/h9,11-12H,2-8H2,1H3
charge 0 multiplicity 1
33 atoms
O  -2.045294 -1.227637 -0.899391
O  -5.60519 0.942192 0.348554
O  -4.728712 -1.173776 0.015769
C  0.553069 -0.246064 0.161638
C  1.879999 0.494619 -0.115953
C  -0.689978 0.619226 -0.135923
C  3.129219 -0.359937 0.195986
C  -2.009506 -0.136394 0.083492
C  4.459751 0.377564 -0.075957
C  5.709451 -0.47652 0.237511
C  -3.234286 0.797454 -0.088871
C  7.033983 0.271945 -0.027256
C  -4.549268 0.068559 0.089173
H  0.530584 -0.568859 1.224206
H  0.496304 -1.165447 -0.450584
H  1.917206 1.428493 0.484677
H  1.908318 0.808287 -1.180627
H  -0.679304 1.524461 0.50589
H  -0.659678 0.961798 -1.190004
H  3.098758 -0.6789 1.259201
H  3.095255 -1.290616 -0.407949
H  -2.02561 -0.556469 1.115456
H  4.492607 0.69618 -1.139169
H  4.493479 1.308972 0.527898
H  5.672137 -0.800826 1.297795
H  5.678933 -1.403343 -0.371274
H  -3.222684 1.224404 -1.112101
H  -3.198575 1.648325 0.615081
H  7.103355 1.18529 0.593612
H  7.108823 0.581463 -1.0870
H  7.911275 -0.360652 0.2027
H  -2.887964 -1.735878 -0.743414
H  -6.453553 0.425586 0.430233
