program: Gaussian 09
title: 000262248
version: EM64L-G09RevD.01
frameworkgroup: C1[X(C10H14O3)]
method: RPBEPBE
basis: SDD
operation: Freq
keyword: #pfreq=noraman
keyword: PBEPBE/SDD
title: #p freq=noraman PBEPBE/SDD
converged: YES YES NO NO
title: Mulliken charges:
elementType: O O O C C C C C C C C C C H H H H H H H H H H H H H H
charge: -0.228723 -0.253111 -0.219741 -0.162783 -0.128625 -0.026190 -0.438077 -0.443469 -0.402972 -0.130992 -0.320778 0.157060 -0.526222 0.222778 0.247927 0.176592 0.233171 0.210883 0.224874 0.242621 0.197671 0.216106 0.241446 0.252018 0.238008 0.191666 0.228863
chargesum: 0.00000
title: Mulliken charges with hydrogens summed into heavy atoms:
elementType: O O O C C C C C C C C C C
charge: -0.228723 -0.253111 -0.219741 0.059995 0.119301 0.150402 0.005977 0.024026 0.010805 0.110454 -0.068760 0.157060 0.132315
polarizability: 1.21424408e+02 -7.81260438e+00 1.20111619e+02 -2.30538052e+00 9.81005188e+00 9.29022444e+01
1716.lowfreq: -13.2135 -5.7548 0.0003 0.0004 0.0007 19.9318 52.6488 90.8659 131.6722
frequency: 52.6289 90.8431 131.6563 142.8721 157.2858 198.7712 225.7722 240.8903 295.8995 347.6266 380.2164 382.0479 446.0258 451.0571 482.8909 530.2754 559.3826 628.6929 668.1093 729.4267 797.6957 805.3842 829.2777 866.9391 885.0827 901.1035 907.5160 933.0636 962.3802 990.5652 1013.4844 1041.4236 1065.3708 1075.1201 1095.7637 1113.2653 1116.9224 1134.6334 1144.9531 1171.7015 1208.3513 1212.2127 1237.9597 1261.5773 1286.6922 1308.9900 1310.4048 1328.4420 1338.6431 1344.4312 1354.8794 1361.7738 1373.6090 1433.6834 1458.4051 1463.2992 1468.5365 1473.7819 1482.0348 1614.7131 1654.4698 2870.5585 2927.9568 2970.5216 2976.1699 2988.8183 2992.9345 3012.7545 3017.8027 3043.5240 3055.8471 3078.6101 3104.0937 3120.8544 3174.4273
redmass: 3.9425 3.6259 3.8112 2.8471 3.1048 4.0010 1.4656 2.8188 1.9520 5.0405 3.8232 3.0314 3.6698 3.9636 3.6201 3.5659 3.6309 4.1365 2.8753 3.2729 2.5859 2.4323 2.3058 3.3858 2.7902 3.2544 1.8657 3.1036 2.9508 1.3017 2.7054 1.6729 2.4558 2.5862 1.4881 2.2164 1.3725 1.8157 1.8623 1.6036 1.4987 1.5475 1.3544 1.2315 1.2571 1.2678 1.2739 1.4519 1.5430 1.5857 1.3054 1.7132 1.5500 1.1346 1.0603 1.0868 1.0838 1.0893 1.0513 8.4671 8.7860 1.0807 1.0376 1.0650 1.0822 1.0843 1.0617 1.0619 1.0985 1.0950 1.1033 1.1037 1.0976 1.0898 1.0974
irintensity: 4.3658 4.9307 0.6697 1.8777 2.5245 1.9709 1.8613 2.5480 2.7652 2.1300 2.0873 0.7129 8.8346 0.9658 2.5727 5.3966 1.2473 1.6793 5.5267 0.8576 28.5774 22.8239 28.4629 30.7756 20.7911 28.2875 21.7256 11.2268 48.0766 1.3198 17.3871 36.0498 70.7422 50.0061 3.0331 28.4849 7.1736 22.4750 22.5304 6.9439 39.1510 36.4528 0.4348 3.0174 1.2802 7.9955 0.3033 0.9264 0.9777 1.0188 16.9318 13.8915 14.1467 4.0330 6.7727 10.8979 11.5746 10.0466 10.9485 61.8545 256.7402 55.6755 69.1330 41.5009 15.2771 49.7388 29.9942 14.6867 54.0703 41.6995 35.4381 34.0143 30.5868 14.8558 8.7235
temp: 298.150 k
press: 1.00000 atm
elementType: 8 8 8 6 6 6 6 6 6 6 6 6 6 1 1 1 1 1 1 1 1 1 1 1 1 1 1
symmnumber: 1
zpe: 587999.1 jmol-1
zpe.correction: 0.223957 hartree
zpe.thermalcorrener: 0.235912 hartree
zpe.thermalcorrenthalpy: 0.236856 hartree
zpe.thermalcorrgfe: 0.186104 hartree
zpe.sumelectzpe: -614.099879 hartree
zpe.sumelectthermal: -614.087924 hartree
zpe.sumelectthermalent: -614.086979 hartree
zpe.sumelectthermalfe: -614.137732 hartree
dipole: -0.8177 4.0730 4.8755
dipole: 6.4054
quadrupole: -80.3444 -77.0077 -78.1185
quadrupole: 7.0260 3.4415 -6.7038
quadrupole: -1.8542 1.4825 0.3717 7.0260 3.4415 -6.7038
hfenergy: -614.3238356 hartree
pointgroup: C01 [X(C10H14O3)]
dipole: -0.5117036 -1.6107839 -1.8693096 debye
polarizability: 123.4222657|7.3394415|118.6500649|3.8218666|8.5843919|92.3659413 unknown
InChI: InChI=1S/C10H14O3/c1-12-8-4-2-3-7-5-6-9(11)13-10(7)8/h5-8,10H,2-4H2,1H3
charge 0 multiplicity 1
27 atoms
O  0.541256 0.846703 0.507664
O  -2.245955 1.48308 0.102562
O  2.605502 1.555058 1.224021
C  0.347845 -1.243439 -0.857645
C  -0.196342 0.183785 -0.613518
C  -1.699642 0.177113 -0.259595
C  -0.000989 -2.209109 0.317997
C  -2.012381 -0.763668 0.913711
C  -1.518066 -2.19808 0.617493
C  1.845129 -1.154239 -1.06895
C  2.573514 -0.165852 -0.476484
C  1.953225 0.814706 0.456009
C  -2.044774 2.53282 -0.896124
H  -0.135607 -1.634313 -1.776859
H  -0.014486 0.797814 -1.519364
H  -2.214432 -0.194082 -1.182377
H  0.553778 -1.88768 1.219957
H  0.344295 -3.230163 0.068075
H  -3.101788 -0.748019 1.094072
H  -1.518263 -0.363637 1.818201
H  -2.073577 -2.618663 -0.246541
H  -1.72995 -2.854124 1.48206
H  2.341407 -1.925636 -1.671749
H  3.659905 -0.088179 -0.580387
H  -2.661363 3.381414 -0.560758
H  -2.382568 2.210018 -1.905532
H  -0.98607 2.85577 -0.944941
