program: Gaussian 09
title: 000026629
version: EM64L-G09RevD.01
frameworkgroup: C1[X(C15H23NO2)]
method: RPBEPBE
basis: SDD
operation: Freq
keyword: #p
keyword: freq=noraman
keyword: PBEPBE/SDD
title: #p freq=noraman PBEPBE/SDD
converged: YES YES NO NO
title: Mulliken charges:
elementType: O O N C C C C C C C C C C C C C C C H H H H H H H H H H H H H H H H H H H H H H H
charge: -0.293717 -0.271432 -0.685284 -0.378256 -0.370919 -0.374523 -0.352611 -0.396219 -0.356388 -0.271334 -0.696263 0.178945 0.226457 -0.335513 -0.326788 -0.408059 -0.401123 0.499612 0.193677 0.192966 0.189852 0.190140 0.193891 0.194249 0.188057 0.187690 0.210188 0.210158 0.195231 0.195125 0.222575 0.224849 0.209717 0.209622 0.215370 0.265222 0.265289 0.220505 0.218704 0.310407 0.309929
chargesum: 0.00000
title: Mulliken charges with hydrogens summed into heavy atoms:
elementType: O O N C C C C C C C C C C C C C C C
charge: -0.293717 -0.271432 -0.064948 0.008386 0.009074 0.013617 0.023136 0.024127 0.033969 0.176091 -0.061554 0.178945 0.226457 -0.070291 -0.061499 -0.187554 -0.182419 0.499612
polarizability: 2.81196538e+02 -2.34953510e+01 1.78815272e+02 5.41847162e-01 6.05985510e-01 1.06972245e+02
1716.lowfreq: -11.5516 -0.0009 0.0003 0.0014 3.1891 6.9298 15.7091 20.1366 33.4738
frequency: 15.3556 19.2520 33.0768 41.5345 69.7585 73.0062 76.4730 96.7533 102.5108 132.8509 140.9896 141.1106 165.9401 173.3324 227.2131 235.6409 293.5753 297.0287 330.2110 360.8557 384.0050 406.7741 411.2389 415.8275 441.2431 472.7317 508.3592 523.6803 608.1785 633.9168 678.0895 720.2541 728.5668 751.6283 755.7099 780.2400 791.5221 824.9588 826.5329 843.5214 857.7949 888.1002 917.2401 936.3574 973.2337 984.6762 993.4357 998.3750 1009.9486 1017.6828 1024.0242 1046.1891 1059.3676 1078.4604 1079.8639 1087.3552 1125.8016 1130.5038 1152.2234 1180.4599 1188.4225 1220.0890 1223.8555 1252.2067 1257.8181 1265.6068 1275.0447 1282.9928 1293.4492 1295.6014 1304.0172 1308.5339 1324.8990 1338.4529 1354.9346 1357.5110 1376.3147 1390.4328 1391.5443 1447.2868 1460.9099 1461.6714 1466.2722 1468.4541 1474.6261 1478.0578 1480.8863 1486.9107 1489.6426 1517.0812 1570.1910 1610.6934 1631.9774 1646.0724 2950.5823 2951.9153 2955.2179 2962.0181 2968.2875 2971.5755 2984.3468 2985.9470 2992.4798 2996.2521 3005.0713 3021.1866 3034.8727 3042.6653 3067.9020 3069.7561 3070.3866 3122.8435 3125.6724 3158.0990 3173.2093 3561.2825 3701.2887
redmass: 4.0686 3.0719 2.1396 3.3235 2.4851 4.4190 2.4906 3.6790 2.4500 2.1548 2.2648 3.5819 4.8094 3.2607 4.1847 1.1233 4.9180 4.4268 4.2173 4.2427 3.2259 1.1892 1.2421 2.0842 3.3467 3.3343 2.8364 4.7348 6.3728 6.9090 3.9877 1.0619 1.0813 1.1623 3.7457 7.2766 1.1671 1.2637 6.0277 1.8441 1.2083 1.9802 6.7006 1.1961 1.3637 1.3503 4.4069 3.2686 1.1180 1.4897 3.4650 3.2789 4.4102 2.5240 2.2961 2.2625 2.9239 1.2251 1.4731 1.1352 1.6447 1.2903 1.3763 2.4170 1.2514 1.4153 1.1168 1.0532 1.1256 1.0918 1.3454 1.3174 2.9228 1.4362 1.6235 1.6095 1.5927 1.2177 4.8385 4.1963 1.0733 1.0749 1.0688 1.0807 1.0789 1.0424 1.0802 1.0853 1.0950 3.1972 7.3119 10.1625 3.2352 1.4372 1.0589 1.0588 1.0592 1.0590 1.0584 1.0368 1.0967 1.0596 1.0991 1.0567 1.1020 1.1039 1.1041 1.1047 1.1008 1.1074 1.0993 1.0893 1.0893 1.0953 1.0948 1.0450 1.1040
irintensity: 0.1450 0.4338 0.3168 1.0556 1.8753 1.2448 0.3227 0.0336 0.9577 0.0488 0.1034 0.6024 1.6605 1.0041 2.5134 0.0337 10.5433 1.9733 8.2142 6.3838 0.5015 208.3567 104.5858 4.1851 3.8479 2.7351 3.3932 1.5949 11.1528 2.0494 26.4902 14.6204 0.0360 7.5456 8.7517 18.6921 0.6459 0.4118 2.8195 72.4482 1.0593 2.0899 17.3431 0.8214 0.1326 0.2536 2.1365 31.0565 0.0758 11.8779 2.7731 29.4030 370.3917 38.3641 3.0663 32.1561 1.6707 13.2276 1.2924 190.1981 0.0081 4.2734 0.4178 330.6594 4.9954 63.1009 0.5678 0.4231 0.0622 0.1258 5.9804 1.7895 112.5864 7.9787 0.9985 0.3880 3.4337 11.4619 12.7938 6.5943 0.0320 0.0447 0.4074 0.0486 2.3299 12.2768 0.2806 2.6158 32.6978 71.5664 30.6329 346.3184 98.3445 322.7673 0.1907 1.2186 0.1976 31.8840 139.0585 35.2497 0.0581 17.4944 0.4790 51.3268 1.0945 0.2780 49.4757 69.4692 71.3661 114.0236 55.9694 15.6223 23.0621 9.6994 3.8367 109.1383 22.9064
temp: 298.150 k
press: 1.00000 atm
elementType: 8 8 7 6 6 6 6 6 6 6 6 6 6 6 6 6 6 6 1 1 1 1 1 1 1 1 1 1 1 1 1 1 1 1 1 1 1 1 1 1 1
symmnumber: 1
zpe: 923157.4 jmol-1
zpe.correction: 0.351612 hartree
zpe.thermalcorrener: 0.371973 hartree
zpe.thermalcorrenthalpy: 0.372917 hartree
zpe.thermalcorrgfe: 0.298940 hartree
zpe.sumelectzpe: -789.225113 hartree
zpe.sumelectthermal: -789.204752 hartree
zpe.sumelectthermalent: -789.203808 hartree
zpe.sumelectthermalfe: -789.277786 hartree
dipole: 2.2795 -3.6057 -0.0452
dipole: 4.2661
quadrupole: -64.8114 -109.8252 -112.7715
quadrupole: -18.4596 0.0545 0.2627
quadrupole: 30.9913 -14.0225 -16.9688 -18.4596 0.0545 0.2627
hfenergy: -789.5767254 hartree
pointgroup: C01 [X(C15H23N1O2)]
dipole: -0.8957583 1.4193855 0.0057485 debye
polarizability: 281.1623668|-23.5607266|178.8506244|-0.7949439|0.6041518|106.9710642 unknown
InChI: InChI=1S/C15H23NO2/c1-2-3-4-5-6-7-12-18-15(17)13-8-10-14(16)11-9-13/h8-11H,2-7,12,16H2,1H3
charge 0 multiplicity 1
41 atoms
O  -0.873763 -0.3564 -0.045223
O  -1.958637 -2.423126 -0.05075
N  -6.927566 1.788905 -0.004428
C  4.081273 0.346961 0.016256
C  5.486753 -0.290036 -0.065512
C  2.937387 -0.688167 -0.070066
C  6.633044 0.741642 0.032599
C  1.534638 -0.039113 -0.014409
C  8.038824 0.105279 -0.059429
C  0.423043 -1.08732 -0.069555
C  9.178454 1.142323 0.040155
C  -2.024683 -1.164558 -0.042361
C  -3.270531 -0.366822 -0.029753
C  -4.516292 -1.051901 -0.017401
C  -3.272188 1.054939 -0.032564
C  -5.727501 -0.346666 -0.008281
C  -4.47837 1.771253 -0.024181
C  -5.729684 1.082143 -0.01209
H  3.99006 0.914768 0.965698
H  3.967223 1.088786 -0.801659
H  5.579852 -0.850526 -1.019414
H  5.597889 -1.039159 0.746412
H  3.042845 -1.418572 0.759202
H  3.0401 -1.268308 -1.010821
H  6.545959 1.297907 0.989595
H  6.520171 1.495021 -0.775232
H  1.412937 0.664998 -0.860306
H  1.429704 0.552845 0.91549
H  8.150766 -0.648137 0.747002
H  8.125156 -0.449446 -1.01616
H  0.468029 -1.694748 -0.993391
H  0.457207 -1.778853 0.793152
H  9.132985 1.690187 1.000467
H  9.107256 1.888336 -0.774012
H  10.171915 0.66184 -0.027978
H  -4.506325 -2.147139 -0.015538
H  -2.315613 1.585041 -0.042205
H  -6.680088 -0.890225 0.001402
H  -4.4654 2.868048 -0.027298
H  -7.819829 1.302991 0.004038
H  -6.933899 2.80491 -0.00765
