program: Gaussian 09
title: 000026628
version: EM64L-G09RevD.01
frameworkgroup: C1[X(C14H21NO2)]
method: RPBEPBE
basis: SDD
operation: Freq
keyword: #p
keyword: freq=noraman
keyword: PBEPBE/SDD
title: #p freq=noraman PBEPBE/SDD
converged: YES YES NO NO
title: Mulliken charges:
elementType: O O N C C C C C C C C C C C C C C H H H H H H H H H H H H H H H H H H H H H
charge: -0.293767 -0.271515 -0.685339 -0.368953 -0.371879 -0.351580 -0.394889 -0.355741 -0.270823 -0.695744 0.178966 0.226340 -0.335477 -0.326838 0.499741 -0.408015 -0.401072 0.190338 0.191180 0.193284 0.192838 0.188217 0.188388 0.209724 0.209714 0.195227 0.194792 0.225309 0.221978 0.210163 0.215374 0.209957 0.265245 0.265293 0.220546 0.218686 0.309925 0.310406
chargesum: 0.00000
title: Mulliken charges with hydrogens summed into heavy atoms:
elementType: O O N C C C C C C C C C C C C C C
charge: -0.293767 -0.271515 -0.065009 0.012566 0.014243 0.025026 0.024550 0.034278 0.176464 -0.060250 0.178966 0.226340 -0.070232 -0.061546 0.499741 -0.187468 -0.182386
polarizability: 2.67097181e+02 2.26331079e+01 1.67437910e+02 1.12681704e+00 -8.92387158e-01 9.84805624e+01
1716.lowfreq: -5.8302 -0.0010 -0.0009 0.0009 3.5762 7.4140 18.2133 28.9326 35.3759
frequency: 18.0694 28.9089 35.0529 51.9328 77.2597 78.4585 85.7975 101.5051 122.8467 137.6657 165.9922 173.3209 177.7461 231.4266 254.9660 293.5771 332.9078 348.7577 364.9224 406.9633 410.6053 415.9690 425.7600 466.9783 508.6692 521.2774 608.2319 634.2411 678.1683 722.5256 735.5388 755.5171 767.8389 780.0549 825.3134 826.3484 827.8644 843.8026 889.4194 913.1309 915.4972 974.0998 984.9708 997.3666 999.7273 1004.1465 1017.7094 1031.5905 1056.8397 1063.3447 1080.2458 1088.6168 1125.5172 1131.0096 1151.7380 1181.1278 1191.5972 1227.1491 1232.0219 1253.0250 1266.3768 1277.7921 1279.3075 1289.5112 1296.0966 1308.9613 1320.7961 1325.5883 1351.2495 1357.1653 1375.5512 1389.4906 1391.2186 1447.5031 1462.3629 1463.8559 1467.9055 1472.7786 1477.3696 1479.4661 1486.4438 1490.4282 1517.4987 1570.2407 1610.7274 1631.9453 1645.6600 2952.4175 2954.2016 2961.0847 2968.5291 2972.0571 2986.2055 2986.9447 2995.9887 2998.3075 3015.5097 3032.8495 3042.4788 3068.4371 3069.9291 3070.8714 3123.2249 3126.0365 3158.6098 3173.7403 3560.9653 3700.9595
redmass: 4.1883 4.0334 1.9821 2.8770 1.9495 3.9871 3.9958 3.9585 2.0316 2.1716 4.5772 3.3559 4.2655 1.1190 4.4883 4.9174 5.6872 3.4700 3.3520 1.2015 1.1776 2.2555 3.7561 3.0055 2.8461 5.1395 6.3593 6.9082 3.9907 1.0637 1.0862 4.2978 1.1388 7.2539 1.2722 3.1898 1.4312 1.8429 1.9008 1.2018 7.6301 1.3613 1.3495 3.3875 1.1682 3.5929 1.4796 3.2482 3.7487 3.4940 2.1700 2.2979 2.8615 1.2250 1.4698 1.1339 1.5839 1.2910 1.3365 2.6876 1.1895 1.3405 1.0909 1.0852 1.1093 1.3192 1.4154 2.7909 1.5142 1.6537 1.6044 1.2174 4.8007 4.2190 1.0729 1.0739 1.0734 1.0755 1.0425 1.0762 1.0847 1.0957 3.1911 7.2903 10.1471 3.1208 1.4607 1.0588 1.0588 1.0591 1.0587 1.0365 1.0596 1.0970 1.0568 1.0999 1.1030 1.1039 1.1047 1.1013 1.1068 1.0993 1.0894 1.0893 1.0953 1.0948 1.0450 1.1040
irintensity: 0.0072 0.7344 0.1157 1.7924 0.6386 1.4460 1.0116 0.6619 0.0375 0.0284 1.3963 1.0892 1.3469 0.0021 4.0012 10.7166 0.0445 10.5106 4.8338 235.8640 79.8012 1.3664 1.1066 4.5666 3.4453 1.8822 11.1124 2.0794 26.5201 13.3853 0.1336 13.6927 1.3664 18.7210 0.7786 2.3924 1.9406 72.5025 3.0942 0.3697 13.2495 0.2006 0.2206 23.5773 2.0941 8.8211 14.1812 2.6482 217.3768 219.9917 7.2206 21.8884 0.3836 14.2176 0.8173 186.9717 0.4998 0.9107 0.1336 374.4161 0.8683 27.5953 1.7958 0.5428 0.2453 2.3761 1.3380 116.1156 5.3124 0.0368 2.8775 11.2021 13.0040 6.5953 0.0198 0.0225 0.8308 0.3504 12.4020 3.3160 0.2108 30.1737 72.1978 31.0841 345.0001 91.5609 328.0701 0.4029 0.1427 16.2572 117.0503 37.5617 15.7363 0.1474 53.5875 0.8255 0.4035 39.0898 44.4284 38.2696 140.9553 55.9109 15.8011 22.8687 9.6562 3.8232 108.8480 22.8999
temp: 298.150 k
press: 1.00000 atm
elementType: 8 8 7 6 6 6 6 6 6 6 6 6 6 6 6 6 6 1 1 1 1 1 1 1 1 1 1 1 1 1 1 1 1 1 1 1 1 1
symmnumber: 1
zpe: 850098.1 jmol-1
zpe.correction: 0.323785 hartree
zpe.thermalcorrener: 0.342726 hartree
zpe.thermalcorrenthalpy: 0.343670 hartree
zpe.thermalcorrgfe: 0.273718 hartree
zpe.sumelectzpe: -750.002049 hartree
zpe.sumelectthermal: -749.983109 hartree
zpe.sumelectthermalent: -749.982165 hartree
zpe.sumelectthermalfe: -750.052116 hartree
dipole: -2.4231 -3.5841 0.0356
dipole: 4.3265
quadrupole: -59.8714 -103.5629 -106.3729
quadrupole: 14.3024 0.1614 -0.3187
quadrupole: 30.0644 -13.6272 -16.4372 14.3024 0.1614 -0.3187
hfenergy: -750.3258347 hartree
pointgroup: C01 [X(C14H21N1O2)]
dipole: -0.9493108 1.4128483 0.0035186 debye
polarizability: 266.9740404|-22.8988946|167.5792274|-0.9818035|0.0346803|98.4623849 unknown
InChI: InChI=1S/C14H21NO2/c1-2-3-4-5-6-11-17-14(16)12-7-9-13(15)10-8-12/h7-10H,2-6,11,15H2,1H3
charge 0 multiplicity 1
38 atoms
O  -0.318695 -0.303898 -0.067506
O  -1.334539 -2.405445 -0.05438
N  -6.440203 1.639294 -0.021756
C  4.606243 0.572656 0.038104
C  3.50181 -0.501994 -0.075869
C  6.035112 -0.009473 -0.047249
C  2.076282 0.095133 -0.015695
C  7.140617 1.063702 0.077434
C  1.002272 -0.990223 -0.092743
C  8.56511 0.475013 -0.014281
C  -1.442041 -1.149716 -0.054872
C  -2.71352 -0.393397 -0.043435
C  -3.935635 -1.119483 -0.017239
C  -2.762492 1.02743 -0.06121
C  -5.219461 0.972697 -0.028169
C  -5.169719 -0.45508 -0.008963
C  -3.991951 1.703033 -0.054215
H  4.469157 1.325923 -0.765796
H  4.488626 1.117666 0.997959
H  3.630678 -1.059073 -1.027213
H  3.629442 -1.244435 0.739478
H  6.156059 -0.54756 -1.010838
H  6.171696 -0.768857 0.751151
H  1.946796 0.66757 0.923267
H  1.932838 0.808498 -0.850399
H  7.021195 1.598912 1.041641
H  7.001619 1.823703 -0.718683
H  1.054565 -1.692498 0.760239
H  1.074005 -1.582043 -1.025014
H  8.742154 -0.262255 0.791561
H  9.336363 1.262418 0.072872
H  8.717995 -0.042597 -0.980261
H  -3.888839 -2.213681 -0.004005
H  -1.824231 1.589034 -0.081489
H  -6.103661 -1.029749 0.011775
H  -4.015763 2.799546 -0.0692
H  -6.480441 2.654432 -0.035771
H  -7.315743 1.124098 -0.003128
