program: Gaussian 09
title: 000262223
version: EM64L-G09RevD.01
frameworkgroup: C1[X(C10H14N2O3S)]
method: RPBEPBE
basis: SDD
operation: Freq
keyword: #p
keyword: freq=noraman
keyword: PBEPBE/SDD
title: #p freq=noraman PBEPBE/SDD
converged: YES YES NO NO
title: Mulliken charges:
elementType: S O O O N N C C C C C C C C C C H H H H H H H H H H H H H H
charge: 0.228739 -0.207681 -0.413987 -0.259201 -0.369657 0.026891 0.315606 -0.630081 -0.537633 -0.728464 -0.735174 0.253309 0.181765 -0.143764 -0.482018 -0.164864 0.227837 0.301101 0.247168 0.313364 0.205838 0.205835 0.261865 0.241496 0.215068 0.206252 0.332528 0.375292 0.270874 0.261693
chargesum: 0.00000
title: Mulliken charges with hydrogens summed into heavy atoms:
elementType: S O O O N N C C C C C C C C C C
charge: 0.228739 -0.207681 -0.038695 -0.259201 -0.037129 0.026891 0.315606 -0.101144 0.022900 -0.054925 -0.072357 0.253309 0.181765 -0.143764 -0.211144 0.096829
polarizability: 1.98258684e+02 1.26964244e+01 1.21291536e+02 -2.03908336e+00 1.49360061e+01 1.28516236e+02
1716.lowfreq: -9.1938 -1.8896 -0.0014 -0.0009 0.0017 11.2162 11.7742 21.2541 37.5404
frequency: 10.8751 21.1612 37.5297 52.0472 70.7617 86.7055 148.4999 172.0117 185.4462 208.0081 218.6405 255.1514 268.2515 293.9904 310.2870 324.7520 331.8843 377.5496 428.5128 469.8121 497.4023 512.1767 535.5878 556.7819 579.9627 596.6724 609.6368 616.5400 650.2549 700.6614 719.6825 769.1819 806.3700 835.7859 858.9164 866.6972 884.7772 905.2427 907.6924 935.7763 950.4937 996.3464 1022.1770 1029.5946 1052.0910 1078.5993 1117.1438 1142.0342 1166.5626 1219.1775 1231.6452 1257.4226 1271.0319 1280.4820 1292.4950 1336.3062 1355.6820 1377.7627 1397.1021 1427.8044 1434.5329 1454.5289 1460.4499 1468.7274 1475.3120 1481.2675 1496.7693 1557.1126 1644.8802 1657.7016 2966.0047 2972.5212 2977.5006 2989.4532 3023.7119 3054.4303 3063.1711 3069.5253 3081.3696 3094.0322 3203.7197 3251.5185 3505.3202 3536.9808
redmass: 8.2046 7.3786 8.4333 6.1927 6.7548 5.4226 2.9599 3.4388 4.8331 1.5822 1.9347 1.0408 5.2115 4.8151 2.3597 5.7198 2.7451 3.3495 2.3276 2.7458 4.4928 2.0056 6.6394 2.4108 2.0507 2.8554 3.7718 6.0763 1.4873 7.0397 1.2821 4.9289 4.0534 5.6253 3.8548 1.3326 1.9827 5.3846 2.7929 1.5535 1.9435 1.6058 1.5069 2.2733 2.1381 1.7431 2.0404 1.8172 1.5646 1.9347 2.5567 1.7751 1.9289 1.7053 1.7689 1.6812 1.8602 1.1902 1.2262 1.1746 1.0855 1.6061 4.1295 1.1070 1.0491 1.0591 1.0625 6.8619 7.3283 6.8006 1.0582 1.0357 1.0369 1.0620 1.0995 1.0966 1.0996 1.0983 1.0998 1.0993 1.0919 1.1013 1.0638 1.0768
irintensity: 1.1732 0.4919 1.6624 1.1989 1.6915 1.6132 4.3924 3.3780 16.9296 1.4743 0.6274 0.5599 1.8004 7.2515 4.9426 5.3212 6.4045 0.9632 0.7068 23.4660 3.0332 35.8664 16.6688 52.0292 18.5170 30.3324 66.5338 24.9109 122.3785 11.7033 63.8886 5.0267 21.3619 0.3706 1.6749 2.5898 22.4588 11.1004 21.3460 10.3447 39.9234 1.8555 2.3158 50.4191 320.9512 6.3408 226.5881 28.0874 0.2764 21.8716 48.5881 18.4434 34.6874 4.1663 0.5130 74.1782 105.9329 30.3996 35.2198 154.4098 24.9597 371.9848 56.5104 64.6335 0.6492 16.2652 24.0479 164.4994 22.9000 260.3576 44.0448 19.6587 42.1085 36.7408 6.0373 3.4912 0.3108 80.2339 23.0069 16.7295 5.9014 1.0860 22.9951 25.9135
temp: 298.150 k
press: 1.00000 atm
elementType: 16 8 8 8 7 7 6 6 6 6 6 6 6 6 6 6 1 1 1 1 1 1 1 1 1 1 1 1 1 1
symmnumber: 1
zpe: 607345.1 jmol-1
zpe.correction: 0.231326 hartree
zpe.thermalcorrener: 0.248367 hartree
zpe.thermalcorrenthalpy: 0.249311 hartree
zpe.thermalcorrgfe: 0.183452 hartree
zpe.sumelectzpe: -1121.486419 hartree
zpe.sumelectthermal: -1121.469378 hartree
zpe.sumelectthermalent: -1121.468434 hartree
zpe.sumelectthermalfe: -1121.534293 hartree
dipole: 0.1329 0.0282 2.5962
dipole: 2.5997
quadrupole: -85.4135 -100.6161 -104.2975
quadrupole: 2.5543 0.4827 -4.8308
quadrupole: 11.3622 -3.8404 -7.5218 2.5543 0.4827 -4.8308
hfenergy: -1121.717745 hartree
pointgroup: C01 [X(C10H14N2O3S1)]
dipole: 0.0347046 0.4696761 -0.9079394 debye
polarizability: 193.2830987|-21.4924187|114.419157|-8.0368182|7.2873375|140.3641999 unknown
InChI: InChI=1S/C10H14N2O3S/c1-10(2,6-8(14)15)5-7(13)12-9-11-3-4-16-9/h3-4,12,14H,5-6H2,1-2H3
charge 0 multiplicity 1
30 atoms
S  3.816858 -0.818439 -1.755189
O  0.340807 -0.16453 1.179418
O  -3.998286 -1.956144 0.252872
O  -2.80516 -1.024252 -1.495325
N  1.533193 0.494589 -0.732664
N  3.352207 -0.06057 0.783589
C  -2.095228 1.332719 0.289951
C  -0.826017 1.13394 -0.593041
C  -2.674812 -0.025287 0.787891
C  -1.754256 2.187707 1.540356
C  -3.15284 2.082718 -0.565627
C  0.363718 0.429863 0.072923
C  -3.12927 -0.993756 -0.282734
C  2.788008 -0.026422 -0.405216
C  5.042315 -1.134954 -0.481697
C  4.603121 -0.689296 0.752664
H  -0.490643 2.129317 -0.949032
H  -1.114543 0.545376 -1.487487
H  -3.53121 0.155914 1.463054
H  -1.901662 -0.541262 1.391475
H  -2.668758 2.40093 2.124954
H  -1.314777 3.157378 1.238977
H  -1.034953 1.668901 2.196235
H  -3.396419 1.52663 -1.488416
H  -4.085902 2.224062 0.011224
H  -2.782149 3.084455 -0.853647
H  1.425639 0.906291 -1.662418
H  -4.241195 -2.607245 -0.461135
H  5.987977 -1.607247 -0.737314
H  5.167339 -0.772891 1.681856
