program: Gaussian 09
title: 000262208
version: EM64L-G09RevD.01
frameworkgroup: C1[X(C5H4N4O)]
method: RPBEPBE
basis: SDD
operation: Freq
keyword: #pfreq=noraman
keyword: PBEPBE/SDD
title: #p freq=noraman PBEPBE/SDD
converged: NO NO NO NO
title: Mulliken charges:
elementType: O N N N N C C C C C H H H H
charge: -0.199812 -0.071463 0.001236 -0.054935 -0.604001 -0.086418 0.119715 0.179703 -0.141026 -0.356876 0.273117 0.253432 0.346740 0.340590
chargesum: 0.00000
title: Mulliken charges with hydrogens summed into heavy atoms:
elementType: O N N N N C C C C C
charge: -0.199812 -0.071463 0.001236 -0.054935 0.083329 -0.086418 0.119715 0.179703 0.132091 -0.103445
polarizability: 1.09082568e+02 -1.18256246e+00 9.51374337e+01 -1.09197527e-03 4.39649733e-04 3.44958296e+01
1716.lowfreq: -8.0521 -2.7407 0.0009 0.0010 0.0011 11.5050 159.0192 207.8457 260.8163
frequency: 159.0138 207.8424 260.8162 289.7449 495.3787 504.6931 523.9370 539.7134 555.6021 587.7216 628.3711 663.8597 689.2234 788.8179 806.5836 818.6047 855.3346 932.4155 947.3116 963.1664 1043.9434 1184.0879 1220.1476 1274.2156 1297.5161 1311.2698 1373.1531 1424.4144 1455.9634 1552.3917 1582.3673 1638.6488 3181.3416 3270.9625 3535.3637 3690.2388
redmass: 6.8074 5.4770 3.5440 7.1062 5.8630 8.2342 1.1803 2.8133 1.2126 6.8350 4.1255 10.0363 7.9962 2.3335 2.6952 9.4742 13.6850 1.4428 8.6273 2.3260 4.1546 3.3363 1.8486 2.6156 5.7697 8.2032 1.6800 3.8473 4.5023 9.8381 1.7127 2.9739 1.0925 1.1009 1.0445 1.1056
irintensity: 2.6787 2.3930 9.0834 3.0493 2.1592 4.3165 224.0481 0.4715 47.6787 1.3329 49.8155 16.5741 2.5264 29.7111 1.9368 8.3670 9.6209 12.6998 70.2838 7.8698 50.0192 3.2341 9.5092 26.2475 33.7112 83.9876 3.4603 42.5385 2.9449 88.0667 13.2581 556.1694 11.1546 2.7616 122.8589 53.6930
temp: 298.150 k
press: 1.00000 atm
elementType: 8 7 7 7 7 6 6 6 6 6 1 1 1 1
symmnumber: 1
zpe: 252736.1 jmol-1
zpe.correction: 0.096262 hartree
zpe.thermalcorrener: 0.103331 hartree
zpe.thermalcorrenthalpy: 0.104275 hartree
zpe.thermalcorrgfe: 0.064649 hartree
zpe.sumelectzpe: -486.447053 hartree
zpe.sumelectthermal: -486.439984 hartree
zpe.sumelectthermalent: -486.439040 hartree
zpe.sumelectthermalfe: -486.478666 hartree
dipole: -0.6610 -3.5386 0.0010
dipole: 3.5998
quadrupole: -50.1454 -56.9692 -58.2206
quadrupole: 1.1945 0.0048 -0.0008
quadrupole: 4.9663 -1.8575 -3.1088 1.1945 0.0048 -0.0008
hfenergy: -486.5433147 hartree
pointgroup: C01 [X(C5H4N4O1)]
dipole: 0.1656436 -1.4065633 -0.0003831 debye
dipolederiv: -0.6553426 -0.2300998 0.0000686 0.0619826 -0.5925577 -0.0000134 0.000375 -0.0002802 -0.1221199 -0.3607109 0.0886535 0.0002234 0.0610831 -0.411721 -0.0001814 -0.0001136 0.0001987 -0.2221129 -0.886869 -0.1072564 0.0000841 -0.1163364 -0.6070271 0.0001002 0.0000426 -0.0001074 -0.1873588 -0.3937855 -0.1419777 0.0001231 0.3742948 -1.002263 -0.0001254 -0.0000645 -0.0000025 -0.2334617 -0.4360284 0.4662537 -0.0000572 0.6612224 -1.2264483 -0.0000284 -0.0001151 0.0000261 -0.684859 -0.2260121 0.4612867 -0.0000653 0.1318093 -0.3238589 -0.0001481 0.0002666 -0.0000323 0.0311157 0.8119597 0.2634911 -0.0003271 0.0786697 0.5516609 -0.0000684 -0.0002328 -0.0001641 0.1652388 0.6815274 -0.5350535 0.0000004 -0.7347468 1.573046 -0.0000248 0.0000132 0.0000144 0.2306656 0.1865656 -0.0687017 0.0000898 -0.0821061 0.7575451 0.00039 -0.0008123 0.0001583 -0.0174722 0.7697813 -0.0469855 -0.0001545 -0.2635604 0.681212 0.0001219 0.0002248 0.0003547 -0.0610858 0.0727949 -0.0111356 -0.000047 -0.0012501 0.1037143 -0.0000438 0.0005721 0.0000413 0.1976235 0.0327421 -0.0790605 0.0000119 -0.0749479 -0.0043056 -0.0000001 -0.0002004 -0.0002201 0.1307916 0.1500241 0.0120899 0.0000271 -0.0550248 0.2903875 0.0000089 0.0000469 -0.0000019 0.3869384 0.2533534 -0.0715042 0.0000227 -0.0410895 0.2106157 0.0000128 -0.0000025 0.0000148 0.3860966 unknown
polarizability: 109.1782679|0.233975|95.0417336|-0.0011191|-0.000365|34.4958296 unknown
InChI: InChI=1S/C5H4N4O/c6-4-3-5(8-1-7-4)10-2-9-3/h1-2H,6H2
charge 0 multiplicity 1
14 atoms
O  -2.059666 0.775024 0.000722
N  -1.3271 -1.432311 0.000408
N  0.123695 1.898677 0.000121
N  2.023589 0.328016 -0.000358
N  1.75245 -2.019351 -0.000174
C  -0.213793 -0.553121 -0.000044
C  -0.644045 0.791079 0.000148
C  1.194236 -0.771874 -0.000208
C  -2.371374 -0.621162 -0.000539
C  1.458507 1.571551 -0.000515
H  -3.428453 -0.871191 -0.000519
H  2.156031 2.413048 0.000094
H  1.161885 -2.848398 -0.000068
H  2.76814 -2.098488 -0.000268
