program: Gaussian 09
title: 000262226
version: EM64L-G09RevD.01
frameworkgroup: C1[X(C11H12N2O3S)]
method: RPBEPBE
basis: SDD
operation: Freq
keyword: #p
keyword: freq=noraman
keyword: PBEPBE/SDD
title: #p freq=noraman PBEPBE/SDD
converged: YES YES NO NO
title: Mulliken charges:
elementType: S O O O N N C C C C C C C C C C C H H H H H H H H H H H H
charge: 0.218722 -0.416060 -0.179035 -0.207654 -0.357820 0.027651 -0.296054 -0.181961 -0.464222 -0.460908 -0.193596 -0.180120 0.225364 0.148883 -0.132756 -0.479786 -0.164474 0.242010 0.250896 0.221010 0.275108 0.234524 0.217071 0.209153 0.205470 0.322342 0.382237 0.271194 0.262811
chargesum: 0.00000
title: Mulliken charges with hydrogens summed into heavy atoms:
elementType: S O O O N N C C C C C C C C C C C
charge: 0.218722 -0.033823 -0.179035 -0.207654 -0.035479 0.027651 -0.054044 0.068935 0.031896 -0.009314 0.015558 0.025350 0.225364 0.148883 -0.132756 -0.208592 0.098337
polarizability: 2.15606596e+02 1.48135942e+01 1.14161592e+02 -4.16850490e+00 1.95907452e+01 1.35825267e+02
1716.lowfreq: -11.1850 -0.0018 -0.0015 -0.0010 1.3734 5.9324 10.4489 18.4445 40.1017
frequency: 9.0002 17.4690 40.0994 60.3113 73.8398 92.3832 123.2074 132.4862 184.9154 224.5968 239.0719 260.0951 294.2835 340.8261 357.4877 380.7326 461.1828 503.2208 515.4109 538.1774 575.6951 585.9734 594.5300 603.6628 623.4664 655.8948 666.8796 697.2701 717.4171 727.9556 752.5691 788.3594 830.4955 855.4501 865.7396 882.6828 901.5807 932.2819 956.2581 969.3228 972.4313 1019.0037 1031.6564 1040.1286 1072.4878 1088.9751 1092.8560 1124.7717 1162.2589 1197.4923 1209.3987 1231.8257 1237.0641 1257.7517 1270.3211 1278.6267 1298.5268 1339.7957 1354.5509 1371.7854 1381.3596 1453.1003 1456.6906 1461.4579 1464.5230 1563.0792 1653.9807 1670.5718 1687.7743 2963.0962 2973.2386 2987.6428 3017.7995 3025.6699 3035.2654 3106.4659 3137.4355 3203.9429 3252.8367 3518.3052 3540.5667
redmass: 9.0223 8.9598 7.1285 5.0613 6.7413 4.1434 5.2855 4.0771 4.2143 6.2265 3.4206 5.4902 9.4871 5.4221 4.1704 2.2729 3.9495 4.7846 4.4728 6.7429 1.4397 2.1778 2.3382 4.0295 4.1689 2.0111 1.9310 6.5467 1.3002 5.1429 4.2869 3.0086 5.6816 4.1104 1.3413 4.9335 2.7665 2.9046 2.1740 1.4053 2.6323 2.6033 2.1955 2.5357 2.1490 1.8987 1.7585 1.9541 1.1841 1.1380 1.1799 2.5185 1.4511 1.4571 1.4581 1.6960 1.3555 1.5110 1.6870 1.6896 1.6809 1.0907 2.2812 1.2104 2.3999 7.0364 7.4158 8.3486 6.5839 1.0645 1.0836 1.0604 1.0943 1.0859 1.0997 1.0842 1.0998 1.0919 1.1013 1.0641 1.0767
irintensity: 0.0074 0.7403 0.3357 0.3789 3.4421 0.9637 5.3906 1.6982 2.4457 4.1257 0.5204 7.1145 2.9442 3.1394 6.0661 3.0612 1.3890 6.7445 20.1367 29.0191 42.7392 32.1811 130.0018 12.1133 22.8772 58.6915 40.8614 19.0019 60.1565 10.8934 14.1281 4.0589 1.8196 4.4671 2.2741 6.3424 5.0847 9.1599 5.9871 3.1773 12.7831 2.3725 32.4146 228.3517 7.1371 4.6248 26.0182 210.5718 22.6549 13.3250 4.1124 28.8918 5.6709 18.4759 13.3263 5.8898 16.5573 3.6264 2.6972 20.6953 4.8429 12.9121 333.8581 22.5400 293.0555 179.1396 107.1539 223.6919 14.4289 32.9342 20.4955 12.2110 15.8253 22.5390 20.2297 6.3647 58.6952 6.1028 1.0799 29.4082 20.4315
temp: 298.150 k
press: 1.00000 atm
elementType: 16 8 8 8 7 7 6 6 6 6 6 6 6 6 6 6 6 1 1 1 1 1 1 1 1 1 1 1 1
symmnumber: 1
zpe: 569654.5 jmol-1
zpe.correction: 0.216970 hartree
zpe.thermalcorrener: 0.233097 hartree
zpe.thermalcorrenthalpy: 0.234041 hartree
zpe.thermalcorrgfe: 0.169470 hartree
zpe.sumelectzpe: -1158.334379 hartree
zpe.sumelectthermal: -1158.318252 hartree
zpe.sumelectthermalent: -1158.317308 hartree
zpe.sumelectthermalfe: -1158.381879 hartree
dipole: 1.2539 0.5114 4.5255
dipole: 4.7238
quadrupole: -97.6960 -104.2292 -106.6751
quadrupole: 5.6331 -6.3432 -2.6237
quadrupole: 5.1708 -1.3625 -3.8083 5.6331 -6.3432 -2.6237
hfenergy: -1158.5513489 hartree
pointgroup: C01 [X(C11H12N2O3S1)]
dipole: -0.4226532 -0.7330195 -1.6546766 debye
polarizability: 214.7683134|-15.9710865|102.9152288|7.1970285|-0.6117022|147.9099125 unknown
InChI: InChI=1S/C11H12N2O3S/c14-9(13-11-12-5-6-17-11)7-3-1-2-4-8(7)10(15)16/h1-2,5-8,13,15H,3-4H2
charge 0 multiplicity 1
29 atoms
S  -3.710166 -0.124443 -1.701709
O  0.770756 2.327706 -0.536334
O  -0.401544 0.284003 1.604923
O  2.885295 1.986056 0.366235
N  -1.308087 -0.691121 -0.338178
N  -3.308222 -0.198205 0.958438
C  1.127624 -0.841547 0.032371
C  1.779452 0.193318 -0.966963
C  2.063212 -1.145384 1.225088
C  3.140942 -0.342675 -1.486867
C  3.473722 -1.449399 0.769478
C  3.951813 -1.094884 -0.449473
C  -0.244553 -0.352499 0.537243
C  1.920324 1.558259 -0.299764
C  -2.658252 -0.372014 -0.17181
C  -5.070524 0.20291 -0.574081
C  -4.651583 0.134975 0.742662
H  0.993143 -1.774239 -0.554091
H  1.090187 0.337017 -1.819544
H  1.652567 -2.001148 1.795114
H  2.052901 -0.287092 1.925127
H  3.740281 0.507285 -1.867967
H  2.957521 -0.999724 -2.362739
H  4.128162 -1.967288 1.482528
H  4.986225 -1.339904 -0.724392
H  -1.051403 -1.159148 -1.209825
H  0.8202 3.174083 -0.014472
H  -6.064749 0.408247 -0.963621
H  -5.292643 0.300454 1.608925
