program: Gaussian 09
title: 000262170
version: EM64L-G09RevD.01
frameworkgroup: C1[X(C14H13NO)]
method: RPBEPBE
basis: SDD
operation: Freq
keyword: #p
keyword: freq=noraman
keyword: PBEPBE/SDD
title: #p freq=noraman PBEPBE/SDD
converged: YES YES NO NO
title: Mulliken charges:
elementType: O N C C C C C C C C C C C C C C H H H H H H H H H H H H H
charge: -0.299500 -0.066764 0.053905 0.287873 0.428169 -0.326685 -0.338836 -0.383416 -0.233556 -0.244410 -0.370099 -0.376245 -0.232964 -0.222195 -0.234665 -0.534259 0.256248 0.236083 0.271240 0.229565 0.226074 0.224721 0.273692 0.225365 0.225626 0.227505 0.243364 0.226939 0.227223
chargesum: 0.00000
title: Mulliken charges with hydrogens summed into heavy atoms:
elementType: O N C C C C C C C C C C C C C C
charge: -0.299500 -0.066764 0.053905 0.287873 0.428169 -0.070437 -0.102753 -0.112176 -0.003991 -0.018336 -0.145378 -0.102552 -0.007599 0.003430 -0.007160 0.163267
polarizability: 3.26236627e+02 -1.72397834e+01 1.78372873e+02 -1.15300857e-01 -4.00960434e-01 6.64985335e+01
1716.lowfreq: -4.4346 -0.0011 -0.0008 -0.0005 3.7013 5.8956 19.1847 53.6176 71.6380
frequency: 19.1616 53.6027 71.6339 96.6984 122.0535 167.7143 189.3875 245.4813 253.2178 263.8881 276.3440 329.7274 381.3228 406.2478 461.4640 505.9954 510.9235 541.5363 565.6501 569.4066 614.8814 641.4048 698.3759 727.4257 735.7046 756.1688 775.0763 828.2116 851.7563 856.5324 858.3443 928.4666 941.4101 978.3928 979.9455 984.2921 987.6793 993.3102 1007.4080 1020.3400 1041.0551 1076.2956 1103.6098 1110.2140 1146.8839 1166.1079 1167.9894 1172.8374 1179.2018 1211.3075 1248.7285 1262.4286 1309.6801 1359.6858 1363.0334 1392.4072 1426.8878 1436.6368 1446.2244 1462.2626 1467.4741 1476.8546 1483.7534 1556.7270 1568.5446 1585.5847 1609.8969 1613.9874 2967.1520 3047.9852 3059.2223 3114.8642 3124.8109 3125.9117 3133.0791 3139.8058 3148.9308 3155.6445 3161.5283 3166.0442 3174.0113
redmass: 3.5525 4.8331 4.6184 3.2381 4.3324 4.7871 2.7784 1.5213 4.9085 2.2014 4.1090 4.3145 4.9506 2.8390 3.0603 3.0848 7.5986 4.7422 3.7625 6.2603 6.4771 6.2161 1.8139 5.4873 2.9251 1.2726 1.8217 5.4681 1.4988 1.2515 5.0934 1.3741 1.3762 1.3260 8.7610 1.3961 6.2812 1.5427 1.3829 2.1175 2.1145 1.6130 2.0809 1.2588 1.5156 1.3390 1.1448 1.3200 1.2970 2.7879 2.2350 1.4723 1.4451 1.6835 8.3769 4.8561 1.4977 1.9602 1.9206 1.8164 1.0505 1.3083 2.2343 7.0076 6.4719 6.0500 6.1900 6.3920 1.0322 1.0879 1.1044 1.0868 1.1000 1.0869 1.0854 1.0923 1.0897 1.0959 1.0941 1.0998 1.1000
irintensity: 0.0282 2.3692 1.3202 0.5503 7.2312 0.5499 2.3344 6.2883 0.6959 3.2367 0.6520 1.7454 2.3697 0.0997 0.5958 20.1445 21.6191 1.6363 0.9540 10.8901 0.0097 1.0011 52.0169 5.3617 11.2849 74.1027 67.5674 1.3143 0.8453 0.1937 5.1615 0.0120 6.2387 1.5768 51.5595 4.3538 0.0793 14.0436 6.7551 7.1754 12.4759 19.7111 32.4245 0.0498 0.6532 16.1936 8.2017 2.8721 1.7524 80.3225 46.3268 11.1826 8.7694 1.0803 6.0953 1.8829 8.2475 7.9943 15.5175 86.1389 13.6263 2.9431 8.8608 32.4011 16.3818 2.5650 11.1962 25.6083 71.1107 14.8024 41.6950 8.1605 16.4276 0.0038 0.1322 27.7059 12.3183 30.3978 27.3204 31.9165 22.8964
temp: 298.150 k
press: 1.00000 atm
elementType: 8 7 6 6 6 6 6 6 6 6 6 6 6 6 6 6 1 1 1 1 1 1 1 1 1 1 1 1 1
symmnumber: 1
zpe: 605082.4 jmol-1
zpe.correction: 0.230464 hartree
zpe.thermalcorrener: 0.244336 hartree
zpe.thermalcorrenthalpy: 0.245280 hartree
zpe.thermalcorrgfe: 0.188379 hartree
zpe.sumelectzpe: -670.110280 hartree
zpe.sumelectthermal: -670.096407 hartree
zpe.sumelectthermalent: -670.095463 hartree
zpe.sumelectthermalfe: -670.152364 hartree
dipole: 1.7360 2.6741 0.0043
dipole: 3.1882
quadrupole: -73.4074 -77.4791 -100.7084
quadrupole: 5.1768 0.0226 -0.0346
quadrupole: 10.4575 6.3859 -16.8434 5.1768 0.0226 -0.0346
hfenergy: -670.3407435 hartree
pointgroup: C01 [X(C14H13N1O1)]
dipole: 0.6349545 0.8957237 -0.6065078 debye
polarizability: 327.4241203|-6.3872549|140.7255507|9.2731324|-51.9605929|102.9583629 unknown
InChI: InChI=1S/C14H13NO/c1-16-14-10-6-5-9-13(14)15-11-12-7-3-2-4-8-12/h2-11H,1H3
charge 0 multiplicity 1
29 atoms
O  1.590153 1.51191 -0.90433
N  0.066989 -0.588266 0.519683
C  1.475551 -0.481791 0.469423
C  2.280444 0.510201 -0.201585
C  -2.244774 -0.016204 0.070922
C  2.16854 -1.498921 1.185997
C  3.693126 0.455084 -0.138654
C  -0.794361 0.213933 -0.068436
C  3.574039 -1.557098 1.250514
C  4.338085 -0.573846 0.58376
C  -3.153891 0.868678 -0.573205
C  -2.762937 -1.101649 0.833742
C  -4.547703 0.676828 -0.459542
C  -4.153319 -1.292338 0.945793
C  -5.052157 -0.404539 0.300358
C  2.375445 2.545145 -1.58703
H  1.543019 -2.242461 1.689752
H  4.299187 1.208766 -0.650142
H  -0.491954 1.079981 -0.679708
H  4.067289 -2.356361 1.812837
H  5.432698 -0.601271 0.621442
H  -2.760947 1.706866 -1.163078
H  -2.048233 -1.771231 1.322883
H  -5.2385 1.365252 -0.959259
H  -4.544741 -2.130866 1.533168
H  -6.133922 -0.556108 0.389913
H  1.631062 3.21029 -2.049128
H  3.02074 2.105541 -2.37127
H  2.993367 3.117674 -0.869318
