program: Gaussian 09
title: 000262287
version: EM64L-G09RevD.01
frameworkgroup: C1[X(C14H15BrO7)]
method: RPBEPBE
basis: SDD
operation: Freq
keyword: #p
keyword: freq=noraman
keyword: PBEPBE/SDD
title: #p freq=noraman PBEPBE/SDD
converged: YES YES NO NO
title: Mulliken charges:
elementType: Br O O O O O O O C C C C C C C C C C C C C C H H H H H H H H H H H H H H H
charge: 0.011115 -0.244045 -0.262852 -0.310670 -0.266862 -0.252761 -0.223451 -0.189564 0.416894 -0.184474 0.007628 -0.288891 0.273226 -0.210165 -0.302059 0.345379 0.314937 0.263393 -0.510889 -0.756933 -0.754852 -0.766764 0.307458 0.282682 0.279333 0.234973 0.238369 0.240737 0.247866 0.255792 0.255941 0.249193 0.255747 0.255000 0.242225 0.242503 0.304840
chargesum: 0.00000
title: Mulliken charges with hydrogens summed into heavy atoms:
elementType: Br O O O O O O O C C C C C C C C C C C C C C
charge: 0.011115 -0.244045 -0.262852 -0.310670 -0.266862 -0.252761 -0.223451 -0.189564 0.416894 0.122984 0.007628 -0.006209 0.273226 -0.210165 -0.022726 0.345379 0.314937 0.263393 0.203191 0.002667 0.005088 0.022804
polarizability: 2.33514856e+02 1.95269732e+01 2.18199320e+02 -2.82180180e+00 -9.35078216e+00 1.35595423e+02
1716.lowfreq: -5.5392 -2.1246 -0.0001 -0.0001 0.0005 3.6550 18.4302 38.0735 41.2384
frequency: 18.4097 38.0678 41.2361 46.9281 49.1325 54.2294 59.0313 62.0237 72.5409 81.1580 83.1136 121.2225 126.1034 136.4706 140.0646 151.0894 175.3556 192.3952 212.0275 218.9355 233.1796 239.2402 258.2769 287.5233 319.4565 331.7905 380.8485 395.3345 441.2652 452.0057 500.6544 538.1666 547.8647 551.6923 555.7279 567.5387 585.3933 596.0460 619.5533 632.8671 665.5162 704.9719 748.1377 789.6497 829.6466 847.1637 859.9315 874.8639 882.2125 887.2846 921.7927 970.5301 985.8406 989.4922 1008.2042 1042.9863 1044.1850 1045.8658 1046.6297 1081.5464 1105.2482 1129.0096 1155.1323 1171.6020 1174.7372 1200.8011 1223.8938 1273.6616 1326.3045 1329.0570 1373.9494 1381.7845 1384.4845 1385.8424 1400.2060 1441.0726 1449.7040 1450.6993 1452.1344 1452.5567 1453.3115 1453.6763 1458.0871 1462.8391 1479.0975 1577.1846 1592.5609 1660.1028 1674.0908 1692.7421 2991.6326 3007.9111 3008.6441 3010.0403 3078.5233 3096.2672 3098.7449 3101.1335 3105.9576 3121.6855 3139.6768 3144.1894 3145.2308 3183.5329 3188.8876
redmass: 6.0962 3.8574 3.3901 3.8664 6.6705 1.7677 4.0160 1.6814 3.0204 3.9749 2.1074 4.8373 1.1495 3.9181 5.0162 7.4581 4.2962 3.6395 1.4166 4.7745 6.8988 5.6068 4.9244 5.2820 4.3949 5.0328 5.9258 4.8546 4.2088 5.2602 4.5265 5.0701 3.9282 4.1136 3.8713 3.4262 4.8760 4.9058 5.1071 5.7184 5.4520 5.4176 6.8227 8.0942 4.3012 7.3636 6.1493 1.7159 1.5656 8.2706 5.1429 4.3390 2.0173 2.2480 2.4284 1.6643 1.6816 1.6312 4.0298 2.3484 1.2518 2.5676 1.5152 2.7359 2.9379 3.6329 1.4329 3.0114 1.3554 1.5527 5.5435 1.2327 1.2431 1.2508 2.9920 1.8854 1.0559 1.0559 1.0586 1.1385 1.0537 1.0546 1.8655 1.0578 1.0506 7.7537 8.2843 9.6831 10.1190 10.8730 1.0294 1.0378 1.0377 1.0363 1.0861 1.1046 1.0953 1.0953 1.0957 1.1043 1.1025 1.1018 1.1019 1.0927 1.0934
irintensity: 0.5886 1.1456 1.3047 1.9850 0.6838 0.8819 4.9827 2.3847 1.8003 1.0926 1.3137 6.9084 0.7268 1.9687 1.5746 3.1202 0.4629 0.7270 0.2217 6.2408 1.8128 3.8722 1.3482 11.7897 0.9757 5.4785 5.7311 3.3625 18.4013 0.3110 26.7744 10.5652 2.9190 3.2163 5.9269 7.4406 2.6790 12.8148 8.6697 0.6751 18.2736 23.5021 18.5916 95.9110 41.4689 9.5873 293.0910 1.9290 34.7137 76.0373 47.0560 166.2876 25.7148 60.4445 112.9894 9.3134 12.1298 25.2353 62.6518 28.2879 0.5306 258.3168 10.5655 48.0476 278.9791 521.9954 23.2369 105.7823 22.5731 17.8766 55.6570 67.3813 57.3203 50.7607 97.0072 12.0611 4.3562 23.1117 28.7994 4.8467 18.7466 13.0342 96.4638 25.0409 19.2127 55.5650 93.0091 91.6409 263.0488 139.1220 60.9672 0.7737 1.1022 7.9963 4.2156 31.2553 5.6630 4.5215 3.6490 23.0891 7.6909 8.2794 7.8685 0.3591 0.5765
temp: 298.150 k
press: 1.00000 atm
elementType: 35 8 8 8 8 8 8 8 6 6 6 6 6 6 6 6 6 6 6 6 6 6 1 1 1 1 1 1 1 1 1 1 1 1 1 1 1
symmnumber: 1
zpe: 702973.8 jmol-1
zpe.correction: 0.267749 hartree
zpe.thermalcorrener: 0.292340 hartree
zpe.thermalcorrenthalpy: 0.293284 hartree
zpe.thermalcorrgfe: 0.209487 hartree
zpe.sumelectzpe: -1080.868764 hartree
zpe.sumelectthermal: -1080.844173 hartree
zpe.sumelectthermalent: -1080.843228 hartree
zpe.sumelectthermalfe: -1080.927025 hartree
dipole: 1.5775 -0.7410 -2.2879
dipole: 2.8761
quadrupole: -145.9233 -115.9629 -129.7258
quadrupole: -2.0383 5.1086 -9.2838
quadrupole: -15.3860 14.5744 0.8116 -2.0383 5.1086 -9.2838
hfenergy: -1081.1365121 hartree
pointgroup: C01 [X(C14H15Br1O7)]
dipole: -0.3276891 -0.0399793 1.0823194 debye
polarizability: 202.1062859|-1.0445454|234.1354126|-18.9412271|33.7051894|151.0678999 unknown
InChI: InChI=1S/C14H15BrO7/c1-7(16)20-13-11(5-10(15)6-12(13)19-4)14(21-8(2)17)22-9(3)18/h5-6,14H,1-4H3
charge 0 multiplicity 1
37 atoms
Br 1.979929 -4.041567 -2.308767
O  -2.013151 -0.235154 -0.561313
O  -1.505993 -1.676599 1.224224
O  1.173481 1.297536 0.729836
O  3.832358 0.52625 -0.487949
O  -2.029052 2.046476 -0.043003
O  -3.126128 -0.349648 2.270273
O  1.137284 2.517003 -1.27917
C  0.326491 -0.838573 -0.08349
C  -1.013621 -0.491704 0.515728
C  1.403636 0.075615 0.020579
C  0.487957 -2.064741 -0.766664
C  2.674662 -0.24651 -0.532299
C  1.738403 -2.350925 -1.343091
C  2.825781 -1.471715 -1.231424
C  -2.49909 1.084283 -0.683518
C  -2.612046 -1.470324 2.09108
C  0.987753 2.498898 -0.048318
C  4.054113 1.517236 0.581095
C  -3.630918 1.128683 -1.679536
C  -3.0340 -2.78434 2.700882
C  0.590466 3.627673 0.863312
H  -0.98911 0.386967 1.181861
H  -0.34904 -2.762341 -0.832799
H  3.805134 -1.699403 -1.658781
H  3.649161 1.169816 1.54672
H  3.609269 2.489873 0.309619
H  5.148798 1.618423 0.638707
H  -3.822712 2.169501 -1.977361
H  -3.395242 0.512508 -2.562081
H  -4.54283 0.712854 -1.213925
H  -3.716695 -2.601468 3.543152
H  -2.15442 -3.358372 3.034546
H  -3.555799 -3.392314 1.93969
H  1.064841 3.532547 1.852445
H  0.842184 4.5929 0.398925
H  -0.505058 3.571457 0.995815
