program: Gaussian 09
title: 000026673
version: EM64L-G09RevD.01
frameworkgroup: C1[X(C19H13BrN2)]
method: RPBEPBE
basis: SDD
operation: Freq
keyword: #p
keyword: freq=noraman
keyword: PBEPBE/SDD
title: #p freq=noraman PBEPBE/SDD
converged: YES YES NO NO
title: Mulliken charges:
elementType: Br N N C C C C C C C C C C C C C C C C C C C H H H H H H H H H H H H H
charge: -0.007313 -0.502340 -0.034405 0.233609 0.235268 0.228127 -0.092534 -0.110192 -0.378676 -0.332462 0.574057 -0.308244 -0.308513 -0.260365 -0.264571 -0.233498 -0.237126 -0.472922 -0.317359 -0.188454 -0.224278 -0.261453 0.307353 0.232388 0.268547 0.266522 0.266123 0.230792 0.232144 0.233574 0.233183 0.276132 0.247737 0.232382 0.236765
chargesum: 0.00000
title: Mulliken charges with hydrogens summed into heavy atoms:
elementType: Br N N C C C C C C C C C C C C C C C C C C C
charge: -0.007313 -0.194987 -0.034405 0.233609 0.235268 0.228127 -0.092534 -0.110192 -0.146288 -0.063915 0.574057 -0.041722 -0.042390 -0.029573 -0.032427 0.000076 -0.003944 -0.472922 -0.041227 0.059283 0.008105 -0.024688
polarizability: 3.25972896e+02 -1.92727367e+01 3.20812972e+02 -6.93070738e+00 -3.92847196e+00 1.43655787e+02
1716.lowfreq: -4.2075 -0.0007 -0.0005 -0.0004 2.5735 4.1368 23.5637 37.3714 48.8587
frequency: 23.5299 37.3686 48.8401 83.5331 109.3113 115.4191 132.3055 171.4303 219.4922 236.5407 248.9393 275.3416 310.3030 318.7668 366.1234 398.0443 404.6360 434.7762 436.4880 475.2778 499.7863 504.7486 532.5299 545.8887 572.7075 584.3069 593.2771 616.3346 635.4543 645.5329 666.8195 700.8214 712.7980 747.2805 749.7171 769.9294 773.2385 795.5342 814.0146 846.2333 858.6410 867.3819 873.0548 880.4375 927.3442 935.0738 966.7578 968.5401 976.7931 993.0770 995.1344 996.1048 1018.7325 1021.6208 1040.2301 1083.0504 1109.9661 1127.4210 1151.7160 1160.9659 1173.0722 1183.3632 1223.5717 1243.3197 1251.7520 1283.9577 1288.1942 1310.2916 1348.3899 1366.7026 1374.1429 1396.0144 1424.6665 1429.4114 1441.1860 1451.1512 1454.9332 1480.0252 1496.3163 1525.3218 1550.0709 1551.9087 1571.7313 1606.4916 1611.9123 1631.4395 3127.2145 3133.5029 3139.4883 3139.9420 3148.4502 3155.3947 3156.5963 3165.9278 3167.1654 3171.6483 3174.2177 3178.6376 3482.5800
redmass: 8.2287 5.3010 5.7121 5.5368 5.1457 5.7545 4.3127 4.9052 5.7530 4.7712 4.9363 7.3726 5.2456 5.7689 6.0907 6.1576 3.7329 4.1417 3.5901 2.8549 1.8115 3.0225 5.3879 2.4947 6.3259 4.0805 6.0416 5.0162 5.9918 6.5437 5.6975 4.3834 4.0452 3.1895 1.2882 1.5529 1.3625 3.5646 4.0172 1.3885 5.7023 4.0676 1.5458 2.1398 5.8926 1.3892 1.3596 1.3546 1.3164 6.1012 1.3390 1.3573 2.2875 2.0341 2.1575 3.6870 2.0192 1.6000 1.3272 1.1802 1.0625 1.1979 1.4336 1.6814 2.6237 1.9196 3.3125 2.0404 2.8658 2.5133 3.7746 3.0648 2.7121 5.0726 2.6933 2.2071 3.1995 2.8563 2.8982 6.6912 6.5853 6.1014 4.3860 6.6051 5.7423 6.4071 1.0853 1.0859 1.0894 1.0860 1.0894 1.0897 1.0952 1.0951 1.0944 1.0996 1.0997 1.1005 1.0746
irintensity: 0.2133 1.0947 0.5083 1.8481 0.6331 0.5880 1.1805 1.4615 2.7279 0.1225 2.7448 6.0208 8.0597 5.1365 1.4729 2.2405 5.1117 2.4045 24.8384 9.4804 73.4335 13.3013 5.6579 22.3101 17.9165 9.2802 1.7493 29.3672 8.5128 3.2888 25.5028 14.8003 14.6079 6.7847 81.0919 139.9938 2.3955 1.6648 8.0022 1.5245 0.3235 2.3225 1.5222 3.2276 2.4233 1.7016 0.4114 1.4383 0.1081 58.5885 0.2432 0.5968 1.7489 11.6237 7.3422 14.2550 0.1029 5.5787 9.6341 0.3699 0.1483 2.4504 0.9561 2.2138 3.2625 3.2800 2.7565 18.0407 14.8676 8.6351 120.7139 8.3164 10.0620 167.0385 18.8137 29.8005 1.9689 7.4159 399.8765 40.6827 76.3228 5.1428 5.3464 130.1490 43.9028 7.9118 0.1811 5.0849 12.3744 3.2108 9.3449 7.0123 21.7779 22.1773 2.7439 33.6731 22.7764 13.8064 56.2262
temp: 298.150 k
press: 1.00000 atm
elementType: 35 7 7 6 6 6 6 6 6 6 6 6 6 6 6 6 6 6 6 6 6 6 1 1 1 1 1 1 1 1 1 1 1 1 1
symmnumber: 1
zpe: 694525.3 jmol-1
zpe.correction: 0.264531 hartree
zpe.thermalcorrener: 0.281668 hartree
zpe.thermalcorrenthalpy: 0.282612 hartree
zpe.thermalcorrgfe: 0.217961 hartree
zpe.sumelectzpe: -853.320373 hartree
zpe.sumelectthermal: -853.303235 hartree
zpe.sumelectthermalent: -853.302291 hartree
zpe.sumelectthermalfe: -853.366942 hartree
dipole: -1.5635 0.2912 0.8879
dipole: 1.8215
quadrupole: -136.4274 -117.8511 -138.5662
quadrupole: -4.5770 -2.5227 0.2950
quadrupole: -5.4792 13.0972 -7.6179 -4.5770 -2.5227 0.2950
hfenergy: -853.5849034 hartree
pointgroup: C01 [X(C19H13Br1N2)]
dipole: -0.6700153 -0.0056527 -0.2541694 debye
polarizability: 324.3148376|25.2791002|304.6022518|-17.3184405|48.7613353|161.524566 unknown
InChI: InChI=1S/C19H13BrN2/c20-15-9-3-6-12-18(15)22-19-13-7-1-4-10-16(13)21-17-11-5-2-8-14(17)19/h1-12,22H
charge 0 multiplicity 1
35 atoms
Br -3.633848 0.898573 2.457003
N  -1.042839 0.424628 0.73618
N  3.117765 0.057273 -0.330182
C  0.313042 0.275921 0.346201
C  1.146808 1.440614 0.310849
C  0.891718 -1.00365 0.067622
C  2.560222 1.267863 -0.010055
C  2.305777 -1.046724 -0.300547
C  0.654346 2.770512 0.554714
C  0.176105 -2.24645 0.189236
C  -2.192025 -0.0133 0.053554
C  3.419334 2.422447 -0.014595
C  2.904885 -2.318456 -0.614071
C  1.515199 3.865771 0.535253
C  0.797367 -3.458484 -0.09857
C  2.914228 3.689329 0.26059
C  2.17004 -3.495519 -0.52352
C  -3.480939 0.114086 0.650459
C  -2.14236 -0.547191 -1.268185
C  -4.658373 -0.281087 -0.008007
C  -3.315723 -0.952195 -1.93093
C  -4.579969 -0.828237 -1.309165
H  -1.221251 1.043828 1.532646
H  -0.415522 2.930025 0.729315
H  -0.86493 -2.235308 0.523295
H  4.475172 2.254122 -0.247298
H  3.95942 -2.310069 -0.905989
H  1.122918 4.872355 0.716432
H  0.239621 -4.395284 0.007379
H  3.577395 4.561214 0.254163
H  2.637944 -4.458082 -0.757327
H  -1.173225 -0.628763 -1.768139
H  -5.625066 -0.164662 0.490525
H  -3.240868 -1.359239 -2.944899
H  -5.493268 -1.142562 -1.823139
