program: Gaussian 09
title: 000262187
version: EM64L-G09RevD.01
frameworkgroup: C1[X(C20H24N4O2)]
method: RPBEPBE
basis: SDD
operation: Freq
keyword: #p
keyword: freq=noraman
keyword: PBEPBE/SDD
title: #p freq=noraman PBEPBE/SDD
converged: YES YES NO NO
title: Mulliken charges:
elementType: O O N N N N C C C C C C C C C C C C C C C C C C C C H H H H H H H H H H H H H H H H H H H H H H H H
charge: -0.246586 -0.279180 -0.088549 -0.383178 -0.109330 -0.116912 -0.326631 -0.347437 -0.338223 -0.387432 -0.317258 -0.324416 -0.400587 0.159213 0.285623 -0.345753 -0.328863 -0.348716 -0.308143 0.168177 0.178586 -0.293092 -0.337889 -0.199628 -0.202982 -0.233229 0.179086 0.195345 0.208653 0.189354 0.189599 0.214184 0.220576 0.242599 0.192808 0.213031 0.215654 0.193253 0.259077 0.206544 0.303161 0.279521 0.213397 0.255209 0.275925 0.276927 0.251452 0.231099 0.233156 0.232804
chargesum: 0.00000
title: Mulliken charges with hydrogens summed into heavy atoms:
elementType: O O N N N N C C C C C C C C C C C C C C C C C C C C
charge: -0.246586 -0.279180 -0.088549 -0.080016 -0.109330 -0.116912 0.047801 0.050570 0.065561 0.075743 0.088582 0.084492 0.065035 0.159213 0.285623 -0.066232 -0.115466 -0.093507 -0.032218 0.168177 0.178586 -0.016165 -0.086437 0.031471 0.030174 -0.000426
polarizability: 4.89552862e+02 9.54171823e+01 1.97863204e+02 -4.81605664e+00 2.43802587e+01 2.29875777e+02
1716.lowfreq: -24.7983 -17.3607 -2.7202 0.0005 0.0007 0.0012 1.5949 7.6996 11.1126
frequency: -23.7874 2.2645 11.0697 23.1578 35.5316 46.6566 49.7182 63.0941 93.0410 95.4512 121.5890 143.6581 157.9124 189.1157 202.4563 218.2065 234.0321 255.6339 268.5086 306.4718 325.6032 336.6328 358.6706 375.1978 398.6002 405.6749 409.5881 426.5614 457.4856 465.9755 485.9604 508.5825 520.0599 531.7166 551.6584 569.5930 602.9034 608.6687 628.9641 676.2988 684.0172 692.7350 746.6513 764.9058 776.2036 786.2037 789.0616 806.2112 820.8417 839.2925 843.6628 853.8650 877.7518 889.4459 899.8041 909.7198 918.8012 945.0651 984.2074 986.0683 988.8904 998.3526 1001.9073 1003.6874 1004.8909 1014.5778 1025.8267 1044.1040 1050.7288 1069.6529 1075.7842 1084.9151 1095.5672 1107.5683 1109.3282 1130.4362 1136.2316 1146.6684 1155.3802 1158.8968 1171.0712 1187.7225 1188.9546 1212.2579 1233.9398 1243.7674 1253.2817 1268.7209 1276.2866 1292.0937 1296.3505 1298.9523 1306.3024 1325.4452 1331.6742 1345.4042 1354.8076 1359.0294 1365.2732 1371.9836 1377.7708 1391.0578 1391.2591 1416.4156 1441.8655 1443.0380 1444.0918 1445.1110 1449.7282 1456.7692 1462.9846 1463.8100 1471.5507 1481.2933 1496.2286 1558.4654 1582.1827 1595.4738 1601.7834 1609.1880 2828.7028 2854.7165 2866.6946 2953.9296 2958.6019 2989.9713 2998.9075 3003.1088 3022.3907 3048.0970 3067.6999 3078.4563 3080.2431 3083.7560 3118.6713 3130.0173 3141.1528 3153.1824 3154.0496 3166.7404 3167.6103 3172.9877 3173.3808 3566.3789
redmass: 2.8429 4.4537 6.0481 4.7669 4.4476 5.8802 6.0250 4.3853 4.5120 5.5494 2.7976 4.4898 4.2805 4.6349 4.1235 4.4408 1.7946 4.7765 5.7926 2.3874 3.4094 4.5789 2.8242 4.7441 2.0334 2.8788 2.9395 6.2138 4.0975 2.8139 3.2633 1.8253 4.3298 2.0753 2.9608 6.5859 1.8531 6.4851 6.9900 5.8483 3.5205 1.9536 2.4038 3.1886 3.6280 1.9487 1.6155 3.9184 5.0800 1.5993 1.3647 1.2472 1.5841 2.7105 6.4521 2.6461 2.0954 1.4376 1.3723 6.2088 1.3728 1.8337 1.9881 1.3361 2.3842 2.0840 2.1863 2.8464 2.1890 2.6624 1.4954 2.3519 3.0899 1.3555 2.3601 2.6304 2.3002 2.8590 2.4966 1.2843 1.0607 1.4856 1.0681 1.2683 3.1517 1.3752 1.4658 1.3021 1.8173 1.2074 1.3125 1.2633 1.4046 1.2384 1.2902 1.2765 6.5061 1.3167 1.3755 1.2687 6.0289 4.7494 1.7249 4.2287 1.0821 1.2511 1.9498 1.1236 1.0959 1.0974 1.6830 1.2634 1.9956 1.1010 2.2015 7.2465 6.1775 7.3699 6.2721 6.3008 1.0698 1.0707 1.0689 1.0665 1.0665 1.0872 1.0627 1.0609 1.0893 1.0892 1.0995 1.1023 1.0962 1.0978 1.0893 1.0853 1.0888 1.0883 1.0930 1.0961 1.0938 1.0972 1.0997 1.0775
irintensity: 0.0476 0.6275 0.0660 2.4417 0.3602 2.3972 3.9365 1.4392 1.4799 2.6006 0.2451 0.7640 2.0399 7.8220 4.4839 3.1458 1.9890 1.2793 0.5162 19.4232 4.7737 8.1437 1.1655 2.3086 1.0960 1.0688 2.2002 11.1427 17.9578 1.2334 12.4977 35.6858 8.9051 67.8733 27.9430 10.1905 13.8205 0.1382 4.1137 3.8600 8.0861 86.8480 4.9372 2.1747 2.1386 42.9166 21.9016 21.9754 0.6451 0.4255 14.1999 0.1161 48.0123 4.1586 2.1271 4.7971 18.1649 8.7061 1.0964 2.3320 0.0008 11.6558 17.6065 0.0985 14.7269 9.3645 6.9661 0.3085 24.0802 9.9614 10.4398 4.1117 41.1245 25.6523 2.9658 49.2666 2.8613 47.5216 6.8317 26.3256 0.3468 0.8974 2.4052 1.7807 56.3625 16.7901 30.0719 7.4221 179.6784 4.2619 3.9863 37.5579 0.1658 14.4227 10.9671 13.8743 1.5803 3.5468 3.2619 3.2935 10.2985 0.8041 5.3903 9.2080 4.2908 55.0203 9.3236 11.2225 21.7087 6.6727 7.4600 2.6653 166.5430 10.1620 212.2825 51.4496 7.6576 101.7645 11.1773 1.1716 95.6266 47.7276 137.7360 35.8676 110.5857 25.3159 43.5771 29.3877 51.7225 34.0718 38.3080 16.3700 43.1918 30.3470 27.8909 1.5594 9.3731 1.8649 20.3126 17.0161 6.4976 5.8265 30.8338 11.6438
temp: 298.150 k
press: 1.00000 atm
elementType: 8 8 7 7 7 7 6 6 6 6 6 6 6 6 6 6 6 6 6 6 6 6 6 6 6 6 1 1 1 1 1 1 1 1 1 1 1 1 1 1 1 1 1 1 1 1 1 1 1 1
symmnumber: 1
zpe: 1073186.1 jmol-1
zpe.correction: 0.408755 hartree
zpe.thermalcorrener: 0.432000 hartree
zpe.thermalcorrenthalpy: 0.432944 hartree
zpe.thermalcorrgfe: 0.349857 hartree
zpe.sumelectzpe: -1144.015836 hartree
zpe.sumelectthermal: -1143.992591 hartree
zpe.sumelectthermalent: -1143.991647 hartree
zpe.sumelectthermalfe: -1144.074735 hartree
dipole: -1.9936 -1.3657 -3.5309
dipole: 4.2787
quadrupole: -135.5675 -173.0291 -139.3526
quadrupole: 16.0879 -13.3371 0.5619
quadrupole: 13.7489 -23.7127 9.9638 16.0879 -13.3371 0.5619
hfenergy: -1144.4245912 hartree
pointgroup: C01 [X(C20H24N4O2)]
dipole: 0.7853436 0.7866555 -1.2641521 debye
polarizability: 496.2260881|82.2057549|203.2785683|17.829087|-31.2545587|217.7871864 unknown
InChI: InChI=1S/C20H24N4O2/c25-20(21-11-4-12-24-13-15-26-16-14-24)17-7-9-19(10-8-17)23-22-18-5-2-1-3-6-18/h1-3,5-10,21H,4,11-16H2
charge 0 multiplicity 1
50 atoms
O  -7.094899 2.924557 1.565149
O  -1.949904 -3.108877 0.31748
N  -5.8834 0.898908 -0.141158
N  -2.283139 -1.55559 -1.376925
N  3.958882 -0.469264 0.411007
N  4.559923 0.2172 -0.527908
C  -4.817169 0.249131 -0.942129
C  -6.22823 2.248838 -0.660727
C  -5.560259 0.984366 1.308165
C  -4.697668 -1.263591 -0.669625
C  -7.410982 2.830587 0.13048
C  -6.746385 1.588489 2.077556
C  -3.681608 -1.969844 -1.598732
C  -1.494784 -2.174294 -0.418545
C  -0.074559 -1.683426 -0.284913
C  0.613491 -2.008076 0.911994
C  0.605907 -0.946555 -1.29658
C  1.940669 -1.587266 1.107185
C  1.932923 -0.526292 -1.11169
C  2.609558 -0.840231 0.101705
C  5.910094 0.588686 -0.223652
C  6.593891 0.261649 0.982932
C  6.569844 1.336753 -1.234594
C  7.923042 0.685784 1.161809
C  7.902712 1.758054 -1.046682
C  8.582005 1.433759 0.151282
H  -3.82282 0.743382 -0.777255
H  -5.076978 0.395117 -2.010596
H  -6.508332 2.161694 -1.72817
H  -5.360769 2.953788 -0.587179
H  -4.650197 1.613824 1.481984
H  -5.355936 -0.026907 1.702524
H  -5.693136 -1.724509 -0.817061
H  -4.397058 -1.464267 0.374363
H  -8.304928 2.186216 -0.014616
H  -7.63818 3.860751 -0.190484
H  -6.49536 1.737136 3.140761
H  -7.625357 0.913864 1.990717
H  -3.727362 -3.057122 -1.415582
H  -3.933538 -1.78368 -2.660597
H  -1.927824 -0.737373 -1.871255
H  0.082989 -2.59799 1.66571
H  0.115939 -0.729627 -2.253811
H  2.486207 -1.823549 2.026289
H  2.470815 0.032238 -1.883339
H  6.065738 -0.316172 1.747393
H  6.01694 1.571287 -2.150229
H  8.454933 0.437345 2.087064
H  8.410154 2.334829 -1.827247
H  9.617607 1.75937 0.300034
