program: Gaussian 09
title: 000262152
version: EM64L-G09RevD.01
frameworkgroup: C1[X(C18H27NO)]
method: RPBEPBE
basis: SDD
operation: Freq
keyword: #p
keyword: freq=noraman
keyword: PBEPBE/SDD
title: #p freq=noraman PBEPBE/SDD
converged: YES YES NO NO
title: Mulliken charges:
elementType: O N C C C C C C C C C C C C C C C C C C H H H H H H H H H H H H H H H H H H H H H H H H H H H
charge: -0.444370 -0.080548 -0.074064 -0.106934 -0.449764 -0.452985 -0.493891 -0.414738 -0.410047 -0.364658 -0.340300 -0.422375 -0.239244 0.434840 -0.439449 -0.382475 -0.416469 -0.356390 0.436689 -0.806361 0.208922 0.206846 0.228099 0.187963 0.224967 0.204656 0.198633 0.211501 0.195784 0.179198 0.210860 0.176737 0.194645 0.191822 0.156957 0.223351 0.231507 0.228948 0.187346 0.337529 0.232262 0.261519 0.229221 0.228516 0.230039 0.223711 0.231995
chargesum: 0.00000
title: Mulliken charges with hydrogens summed into heavy atoms:
elementType: O N C C C C C C C C C C C C C C C C C C
charge: -0.106841 -0.080548 0.134858 0.099913 -0.033703 -0.042851 -0.064268 -0.039756 -0.022450 0.021809 0.040008 0.038080 -0.051898 0.434840 -0.207186 -0.120956 -0.187249 -0.127874 0.436689 -0.120615
polarizability: 2.25518969e+02 2.59396741e+01 1.90291737e+02 -1.09491429e+00 -5.14267901e-01 1.75369283e+02
1716.lowfreq: -15.5959 -4.8849 -0.0008 -0.0008 -0.0007 4.0084 14.4912 23.9485 35.5045
frequency: 6.2144 23.2051 34.6673 38.4679 42.8723 78.6753 116.5160 122.2025 132.6654 161.7066 179.9984 204.5929 243.9088 265.3536 305.3268 316.1885 336.8560 344.7295 355.8200 369.6522 379.6352 396.3852 407.0061 424.7314 465.5352 488.1636 548.1789 567.9489 582.7541 636.9981 660.6723 711.4272 733.0670 740.5304 755.2336 772.9672 791.3765 803.0977 807.8653 827.9933 831.4054 853.8475 877.3405 884.4219 919.8185 948.5975 953.5402 963.2189 970.0958 978.3319 985.7467 988.2019 1004.8722 1014.2146 1020.5835 1028.0512 1045.0734 1047.3643 1052.3924 1080.6200 1095.9367 1114.3818 1120.7199 1123.5778 1139.8952 1164.4610 1168.7072 1177.9658 1187.6695 1200.8446 1209.2819 1211.7302 1221.4486 1226.0754 1241.4726 1257.6435 1270.9092 1275.7742 1282.3991 1290.2577 1301.8941 1307.3454 1313.6361 1320.7818 1329.5452 1333.7502 1335.8454 1354.0051 1360.0318 1363.5902 1379.8759 1385.5540 1396.5794 1397.3904 1407.8370 1445.0827 1454.7788 1459.6377 1465.4599 1469.5769 1470.5365 1473.0950 1475.6023 1481.4574 1493.1886 1505.9236 1584.7768 1623.3131 2808.3286 2816.4192 2888.1563 2930.2841 2958.5146 2976.5088 2978.8281 2979.6837 2992.9297 2994.2284 3006.0007 3010.7024 3016.6843 3020.4478 3027.1926 3031.0484 3033.9870 3054.3810 3058.2349 3065.3990 3073.7005 3084.2890 3109.3577 3116.6004 3134.9176 3147.2474 3551.9791
redmass: 3.5145 3.9807 3.3497 1.1124 3.4976 3.4255 3.1259 2.0531 3.2915 3.0950 3.2393 2.3962 3.3856 3.9114 2.7310 2.4381 2.5272 1.2483 2.9368 2.1221 3.4305 1.8952 2.8432 3.5083 2.3063 3.5869 2.6147 4.0927 2.5510 6.8067 3.0812 2.5940 3.0426 3.2827 2.6155 1.8620 1.9374 3.0529 2.6850 1.7569 1.7171 1.2526 2.2293 2.1533 2.4433 1.9280 1.4922 2.3252 1.9634 1.3729 1.5665 2.1661 2.5771 2.6187 2.0849 2.3857 2.2051 1.5610 1.9942 2.3737 1.6426 1.5730 1.4917 1.5598 1.7186 1.4185 1.3168 1.3151 1.1201 1.4129 1.5648 1.7577 2.9169 1.2940 1.3275 1.3381 1.3035 1.2734 1.3903 1.3349 1.3726 1.4477 1.4442 1.3892 1.4636 1.3312 1.5091 1.4545 1.7156 1.3894 1.4836 2.5002 1.3591 1.2991 2.5261 1.0897 1.0902 1.0771 1.0861 1.0851 1.0467 1.0867 1.1019 1.0978 1.0867 2.7024 5.9639 6.3804 1.0723 1.0703 1.0696 1.0839 1.0630 1.0372 1.0673 1.0677 1.0638 1.0791 1.0634 1.0763 1.0877 1.0889 1.0920 1.0919 1.1003 1.0975 1.1029 1.1008 1.1031 1.0988 1.0872 1.0881 1.0960 1.0959 1.0659
irintensity: 0.0946 0.1030 0.3095 0.3596 0.0993 0.1582 1.0666 0.1059 1.4760 0.2999 0.9116 0.1591 3.7248 6.1264 2.7027 2.8631 8.6377 136.8708 6.5437 2.7324 7.3162 1.6153 1.3395 4.9717 2.9119 10.8371 32.5124 7.4142 5.2500 1.0256 1.2174 0.2475 5.2133 2.7457 1.4742 4.3667 1.0782 2.6917 4.1562 30.1415 34.4850 0.7830 4.0982 8.5322 12.4204 27.1118 7.6196 33.2129 9.8641 1.2380 4.4765 6.4785 12.8725 6.0217 4.3915 7.5712 2.9679 12.4576 17.6198 2.0780 2.2424 16.8633 8.8972 18.2306 54.5031 1.9242 5.8457 2.8531 3.0033 7.3139 4.3816 1.8300 1.3411 7.6682 17.7282 7.7623 8.0309 4.6539 1.1438 1.0949 34.1370 5.1404 0.5989 6.7349 5.8451 5.9321 4.5749 11.3931 21.6934 3.2982 6.2269 18.8442 1.5081 8.5798 4.8114 6.6861 12.8561 4.4220 3.4966 10.9389 12.9546 2.2268 16.4672 11.7837 13.7090 19.6338 0.4444 5.6565 41.8840 169.2661 87.7248 55.7409 30.3797 37.5780 6.9546 6.4473 84.5161 82.4861 28.4870 72.8782 48.5611 10.4467 36.2393 52.8724 15.8878 21.8020 73.0160 45.9742 45.9536 19.4573 13.7210 17.6876 29.1986 4.7283 4.6756
temp: 298.150 k
press: 1.00000 atm
elementType: 8 7 6 6 6 6 6 6 6 6 6 6 6 6 6 6 6 6 6 6 1 1 1 1 1 1 1 1 1 1 1 1 1 1 1 1 1 1 1 1 1 1 1 1 1 1 1
symmnumber: 1
zpe: 1083614.6 jmol-1
zpe.correction: 0.412727 hartree
zpe.thermalcorrener: 0.432498 hartree
zpe.thermalcorrenthalpy: 0.433442 hartree
zpe.thermalcorrgfe: 0.360956 hartree
zpe.sumelectzpe: -830.522674 hartree
zpe.sumelectthermal: -830.502903 hartree
zpe.sumelectthermalent: -830.501958 hartree
zpe.sumelectthermalfe: -830.574445 hartree
dipole: -1.3243 -1.3731 -1.3869
dipole: 2.3585
quadrupole: -110.3346 -123.7895 -119.2908
quadrupole: 4.7025 0.6888 -3.3860
quadrupole: 7.4703 -5.9845 -1.4858 4.7025 0.6888 -3.3860
hfenergy: -830.9354007 hartree
pointgroup: C01 [X(C18H27N1O1)]
dipole: -0.5222806 0.5091063 0.5736307 debye
polarizability: 224.6279291|-26.5474486|191.1913213|0.1112316|0.1015251|175.3607382 unknown
InChI: InChI=1S/C18H27NO/c1-14-2-6-17(7-3-14)18(20)9-11-19-10-8-15-4-5-16(12-15)13-19/h2-3,6-7,15-16,18,20H,4-5,8-13H2,1H3
charge 0 multiplicity 1
47 atoms
O  -2.203447 -3.025873 -0.903936
N  1.664628 -0.209136 0.229004
C  4.25709 1.383667 -0.699017
C  4.093312 -0.998443 -0.113097
C  4.13431 -0.030896 -1.329733
C  5.255749 1.152779 0.474005
C  5.004156 -0.309629 0.964779
C  2.896052 1.952539 -0.224563
C  2.646086 -1.311789 0.367766
C  2.106766 1.093596 0.793344
C  0.301615 -0.621399 0.64328
C  -0.370325 -1.58122 -0.36281
C  -1.804899 -1.963341 0.051421
C  -2.792574 -0.801751 0.025021
C  -3.333833 -0.277366 1.222183
C  -3.192206 -0.223747 -1.208827
C  -4.244935 0.804385 1.192314
C  -4.102431 0.851377 -1.235749
C  -4.644165 1.387728 -0.035381
C  -5.620836 2.550693 -0.076228
H  4.677881 2.101693 -1.430943
H  4.534214 -1.976264 -0.387655
H  3.241413 -0.131985 -1.971373
H  5.032088 -0.240254 -1.944248
H  5.959347 -0.855466 1.074941
H  4.514914 -0.32774 1.956983
H  5.122751 1.897393 1.281681
H  6.294015 1.256936 0.106001
H  2.24202 2.103625 -1.105755
H  3.073505 2.949953 0.231387
H  2.264134 -2.16234 -0.227429
H  2.702981 -1.666952 1.432405
H  2.699332 0.963842 1.731054
H  1.203056 1.664706 1.07863
H  0.302685 -1.100228 1.660017
H  -0.319699 0.289916 0.721094
H  -0.385575 -1.106277 -1.360694
H  0.199357 -2.52415 -0.454117
H  -1.781047 -2.383664 1.08256
H  -3.164414 -3.226086 -0.764092
H  -3.044708 -0.717644 2.185275
H  -2.78883 -0.631489 -2.142671
H  -4.653211 1.196146 2.131889
H  -4.40154 1.284615 -2.198688
H  -6.504241 2.314149 -0.698539
H  -5.980303 2.813051 0.933616
H  -5.151332 3.453541 -0.510903
