program: Gaussian 09
title: 000262146
version: EM64L-G09RevD.01
frameworkgroup: C1[X(C19H27NO)]
method: RPBEPBE
basis: SDD
operation: Freq
keyword: #p
keyword: freq=noraman
keyword: PBEPBE/SDD
title: #p freq=noraman PBEPBE/SDD
converged: YES YES NO NO
title: Mulliken charges:
elementType: O N C C C C C C C C C C C C C C C C C C C H H H H H H H H H H H H H H H H H H H H H H H H H H H
charge: -0.454134 -0.097868 -0.040896 -0.110186 -0.485242 -0.461211 -0.429577 -0.466781 -0.406014 -0.354155 -0.360324 -0.460953 -0.123510 -0.173015 -0.335944 0.488770 -0.395788 -0.405519 -0.233411 -0.235726 -0.245213 0.201112 0.211542 0.209142 0.207709 0.212250 0.215033 0.190465 0.207840 0.196403 0.194967 0.212066 0.176255 0.190696 0.198324 0.193537 0.225131 0.216807 0.185179 0.219092 0.243788 0.327977 0.219794 0.226615 0.227477 0.224255 0.225072 0.228170
chargesum: 0.00000
title: Mulliken charges with hydrogens summed into heavy atoms:
elementType: O N C C C C C C C C C C C C C C C C C C C
charge: -0.126157 -0.097868 0.160216 0.101357 -0.068391 -0.033928 -0.031273 -0.075412 -0.017693 0.034865 0.058343 -0.058967 0.095582 0.070773 -0.116149 0.488770 -0.169173 -0.178042 -0.009156 -0.010654 -0.017043
polarizability: 2.67476215e+02 2.90298994e+01 2.27944319e+02 -1.57160769e+01 5.46313475e+00 1.50564638e+02
1716.lowfreq: -16.7963 -4.5831 -0.0006 -0.0006 -0.0002 3.7122 13.2185 18.2333 28.0300
frequency: 11.0858 18.0076 27.9219 46.6530 57.7252 86.1363 105.2115 115.0058 130.6646 153.5151 204.2295 235.1802 255.4512 269.7157 297.9850 300.8993 316.7555 325.2457 353.7099 371.6002 382.0607 401.6032 410.7012 422.7201 467.9759 508.0610 518.2101 548.1180 551.3084 595.9621 616.3394 664.5103 696.9808 706.3443 758.3158 763.3567 765.9833 796.7046 801.8825 812.7343 839.7658 845.0556 861.3137 863.6318 892.0779 903.5325 922.1312 927.5288 954.3022 958.9284 975.3816 978.2250 985.1315 988.5565 993.6049 997.5021 1006.2045 1018.1963 1026.4900 1043.0258 1047.9560 1068.8089 1073.4682 1084.1479 1087.9506 1111.4092 1122.0162 1129.6745 1165.8580 1171.4205 1173.0366 1189.7547 1197.4175 1204.1018 1207.4129 1217.5475 1223.8431 1231.8905 1240.1256 1253.6641 1268.2247 1280.7394 1290.0863 1297.6925 1299.4371 1302.9847 1312.8100 1317.2444 1325.1542 1329.2920 1336.1997 1341.1312 1353.0382 1361.2487 1371.7962 1381.0821 1394.2557 1407.1079 1441.2742 1450.5301 1452.4617 1455.5014 1459.2935 1464.4309 1473.8461 1478.3318 1483.2767 1485.7192 1584.6202 1612.0928 1670.5561 2819.9041 2854.6966 2867.0790 2958.3411 2959.8787 2975.4151 2980.1301 2986.3094 2994.3580 2994.9410 3010.5026 3011.8106 3018.5020 3023.3665 3027.0980 3038.6921 3040.0623 3042.3809 3068.7327 3078.8917 3105.1054 3114.5324 3124.2122 3136.8144 3147.3364 3163.8461 3543.5728
redmass: 4.3334 3.9361 3.8717 4.3375 4.0181 3.5500 4.6157 2.2863 2.7509 2.4851 2.6654 1.7535 2.1763 2.1444 3.0554 2.6438 3.3782 2.6510 2.8384 2.2712 2.6521 2.6372 2.5445 1.8549 2.3579 3.5733 2.7956 2.8107 3.1505 5.5914 6.4166 2.5540 1.7246 2.9850 2.1236 1.7384 1.9649 2.6268 3.5110 2.6777 2.4689 1.3601 1.7920 2.4451 1.9500 2.1117 1.5353 1.8919 2.8502 2.3123 1.4079 2.0927 1.3307 6.0597 2.2412 1.2767 1.9475 2.0344 2.1874 1.9713 2.0410 2.0454 2.1806 1.7371 1.7300 1.9773 1.5945 1.6766 1.3916 1.0800 1.1615 1.1336 1.3935 1.2468 1.3990 1.2684 1.7541 1.8319 1.3960 1.3333 1.2934 1.3344 1.3242 1.3629 1.2384 1.5231 1.5405 1.5529 1.3249 1.3931 1.3367 1.3948 1.3791 1.3697 1.3442 3.8875 1.3940 1.7001 2.0324 1.1411 1.0830 1.0903 1.0854 1.0848 1.0869 1.0981 1.1011 2.2661 5.7955 5.9963 6.2041 1.0706 1.0716 1.0710 1.0641 1.0616 1.0700 1.0646 1.0844 1.0678 1.0772 1.0844 1.0866 1.0860 1.0943 1.0921 1.0986 1.0950 1.1025 1.1033 1.0901 1.0887 1.0871 1.0857 1.0912 1.0959 1.1015 1.0659
irintensity: 0.0239 0.0260 0.1324 0.0404 0.9059 0.3814 1.5864 0.4621 0.5454 2.3589 3.4940 36.6788 49.1057 37.6088 0.7115 2.5764 5.8514 1.0125 1.7208 0.9898 6.2964 0.8379 4.0019 2.7227 2.0629 13.3361 1.8236 3.4947 16.3569 5.8298 0.1484 4.4899 42.9122 12.7360 1.8505 38.9818 12.2435 11.6979 1.0825 2.5624 3.3612 0.6080 3.7045 4.0433 5.7320 3.5995 0.8740 20.1298 72.5315 6.3838 0.1910 50.1473 14.3569 0.4200 7.7507 13.0680 1.5917 3.7071 4.7004 0.4932 7.8313 6.7186 18.9143 4.3831 11.5993 39.2686 38.2041 17.6076 1.7487 1.2311 7.8183 1.2428 1.1301 20.3304 1.1179 6.0307 6.4915 16.6009 1.6102 2.9197 6.7699 13.0659 1.7605 2.0838 5.8986 13.5725 2.6964 1.7702 1.6432 5.3277 1.8179 11.7684 4.9454 3.0780 2.9762 1.8536 0.3200 17.9659 7.3286 9.1703 1.7656 0.1771 8.7544 18.0008 14.2716 10.7855 16.3935 18.6534 2.3190 7.1631 2.7171 84.8557 35.0876 189.2894 48.2012 38.8134 3.1329 14.6622 19.5515 84.8566 90.9511 69.5037 75.1497 35.2497 49.1943 21.7809 14.1149 58.4711 32.4624 97.9739 15.2270 22.7466 16.3325 0.5388 12.9533 42.9582 27.4826 8.9242
temp: 298.150 k
press: 1.00000 atm
elementType: 8 7 6 6 6 6 6 6 6 6 6 6 6 6 6 6 6 6 6 6 6 1 1 1 1 1 1 1 1 1 1 1 1 1 1 1 1 1 1 1 1 1 1 1 1 1 1 1
symmnumber: 1
zpe: 1098307.2 jmol-1
zpe.correction: 0.418323 hartree
zpe.thermalcorrener: 0.438373 hartree
zpe.thermalcorrenthalpy: 0.439317 hartree
zpe.thermalcorrgfe: 0.366896 hartree
zpe.sumelectzpe: -868.548765 hartree
zpe.sumelectthermal: -868.528716 hartree
zpe.sumelectthermalent: -868.527772 hartree
zpe.sumelectthermalfe: -868.600193 hartree
dipole: 2.1096 -0.7573 1.8241
dipole: 2.8898
quadrupole: -118.6953 -122.7778 -132.7685
quadrupole: 6.7622 -5.2736 5.5755
quadrupole: 6.0519 1.9694 -8.0213 6.7622 -5.2736 5.5755
hfenergy: -868.9670884 hartree
pointgroup: C01 [X(C19H27N1O1)]
dipole: 0.8763257 0.2284204 -0.6874046 debye
polarizability: 263.9509675|-28.3780731|229.3476891|24.5517968|-2.3601923|152.6865155 unknown
InChI: InChI=1S/C19H27NO/c21-19(9-8-16-4-2-1-3-5-16)11-13-20-12-10-17-6-7-18(14-17)15-20/h1-5,8-9,17-19,21H,6-7,10-15H2
charge 0 multiplicity 1
48 atoms
O  -0.322465 -3.332872 1.677022
N  2.090045 -0.528563 -0.763176
C  4.113059 0.913538 1.011005
C  2.609662 1.98195 -0.616507
C  4.110136 1.838777 -0.240609
C  2.770683 1.259704 1.7512
C  1.932448 2.140127 0.77365
C  4.230491 -0.592983 0.641248
C  2.032034 0.798554 -1.432768
C  3.486452 -1.031028 -0.643908
C  1.178091 -1.518148 -1.403727
C  0.767206 -2.664141 -0.455565
C  -0.068206 -2.188989 0.764106
C  -1.430252 -1.677139 0.37146
C  -1.785693 -0.362494 0.40257
C  -3.080398 0.227173 0.004263
C  -4.178906 -0.547229 -0.469448
C  -3.249131 1.63771 0.099831
C  -5.394005 0.068048 -0.829932
C  -4.465235 2.255685 -0.261934
C  -5.54549 1.473049 -0.729558
H  4.972586 1.157731 1.665124
H  2.450891 2.885034 -1.240155
H  4.509161 2.83626 0.028615
H  4.732715 1.451636 -1.069491
H  2.964868 1.790038 2.702154
H  2.22674 0.330145 1.993558
H  0.86941 1.836249 0.748219
H  1.965716 3.20275 1.082398
H  3.863272 -1.193175 1.497597
H  5.300038 -0.856644 0.50272
H  0.967125 1.022439 -1.637109
H  2.557201 0.765022 -2.425172
H  4.076079 -0.716463 -1.541297
H  3.469231 -2.137308 -0.666169
H  1.628053 -1.957087 -2.329877
H  0.263219 -0.982454 -1.717402
H  0.182798 -3.415416 -1.023041
H  1.673897 -3.183562 -0.07784
H  0.504031 -1.39529 1.286373
H  -2.13086 -2.457514 0.041999
H  0.54656 -3.761067 1.889937
H  -1.034864 0.356931 0.765516
H  -4.083366 -1.635678 -0.551047
H  -2.41512 2.250209 0.465812
H  -6.228113 -0.545496 -1.189355
H  -4.571095 3.343219 -0.17826
H  -6.492103 1.947763 -1.010629
