program: Gaussian 09
title: 000262139
version: EM64L-G09RevD.01
frameworkgroup: C1[X(C17H22INO)]
method: RPBEPBE
basis: SDD
operation: Freq
keyword: #p
keyword: freq=noraman
keyword: PBEPBE/SDD
title: #p freq=noraman PBEPBE/SDD
converged: NO YES NO NO
title: Mulliken charges:
elementType: I O N C C C C C C C C C C C C C C C C C H H H H H H H H H H H H H H H H H H H H H H
charge: 0.114863 -0.227069 -0.075970 -0.072564 -0.099523 -0.483674 -0.483022 -0.444353 -0.412151 -0.445259 -0.398245 -0.371177 -0.489541 0.081094 0.335000 -0.355832 -0.338494 -0.161854 -0.176806 -0.355326 0.211805 0.211212 0.207068 0.210027 0.208260 0.211161 0.210266 0.216485 0.193110 0.216860 0.185587 0.214950 0.231212 0.192868 0.213003 0.231915 0.227175 0.218028 0.284394 0.256845 0.253395 0.254276
chargesum: 0.00000
title: Mulliken charges with hydrogens summed into heavy atoms:
elementType: I O N C C C C C C C C C C C C C C C C C
charge: 0.114863 -0.227069 -0.075970 0.139241 0.111689 -0.066579 -0.063600 -0.017602 -0.002181 -0.044721 0.025835 0.073741 -0.044338 0.081094 0.335000 -0.071438 -0.081648 0.091541 0.077470 -0.355326
polarizability: 2.87359250e+02 3.46352566e+01 2.11637635e+02 -1.47687892e+01 1.62153309e+01 1.51026365e+02
1716.lowfreq: -11.0480 -6.7625 0.0005 0.0007 0.0009 7.1014 10.2088 14.4082 27.3896
frequency: 4.8832 13.3597 27.1978 47.3446 63.7260 73.5356 105.4225 133.1434 158.4439 184.7549 201.9137 231.4000 256.9679 284.7043 288.6241 326.8840 355.1068 384.2466 396.0344 400.7258 405.7892 421.7785 463.7262 474.0506 488.5757 543.4589 581.2706 619.7468 648.7721 678.1060 684.2115 719.3063 741.9015 752.3615 764.0732 799.4564 812.9347 830.3128 849.8921 874.9208 883.3468 889.9160 914.8353 936.6707 959.7181 960.9817 986.0275 989.8349 992.9988 997.1993 1001.3444 1015.4255 1039.7275 1048.5197 1056.6389 1064.2774 1085.2201 1103.1971 1109.9018 1114.9715 1134.3622 1168.7284 1178.4457 1185.9525 1191.3507 1206.3235 1209.1247 1231.6996 1242.8949 1258.4634 1267.1457 1279.2070 1294.3735 1296.9528 1306.4542 1312.0134 1313.8992 1318.3562 1331.8279 1338.6925 1351.2483 1361.9821 1363.4543 1375.3215 1388.2969 1391.1558 1450.6934 1456.1116 1457.2939 1458.3158 1464.9247 1470.5112 1473.1578 1480.0455 1485.2882 1543.4329 1575.9994 1589.9580 2840.0812 2862.4835 2927.6447 2968.1852 2979.1678 2979.9243 2993.9226 2998.3013 3005.6633 3008.5424 3015.6391 3029.0312 3034.0526 3038.3180 3040.9927 3044.4116 3064.6204 3090.8487 3148.4831 3150.0956 3168.8560 3172.8617
redmass: 3.6830 7.0307 3.9885 3.7412 4.0676 8.4994 2.6196 4.8068 4.3197 2.4132 8.4720 5.7068 4.1753 2.5132 3.2824 2.9108 2.0648 2.6407 2.4299 2.1787 2.8124 2.8064 3.6377 2.3742 4.2559 2.6972 3.3775 7.0970 2.6925 3.5405 2.7562 4.5402 2.7890 2.7380 2.2780 3.0294 2.1171 1.4018 1.3940 2.4840 2.0804 2.3544 2.7623 1.9016 2.0796 1.4025 2.2001 4.3526 1.6983 1.9666 1.9258 1.9855 2.9386 2.5540 2.2306 2.1634 2.0853 1.8895 1.3813 1.4478 1.6617 1.5065 1.2987 1.4844 1.1641 1.3540 1.3788 1.3106 1.2574 1.5162 1.6969 1.3842 1.4019 1.2932 1.3774 1.5443 1.3082 1.4925 1.4974 1.3434 1.3978 4.3349 1.3794 1.3053 3.5975 1.3141 1.3231 1.0813 1.0837 1.0824 1.0980 1.5703 1.1498 1.1127 1.0932 7.9866 6.9232 6.8058 1.0702 1.0711 1.0678 1.0666 1.0658 1.0631 1.0733 1.0712 1.0657 1.0837 1.0819 1.0897 1.0989 1.0933 1.0991 1.1020 1.1043 1.0979 1.0885 1.0885 1.0960 1.0973
irintensity: 0.1990 0.3552 1.0296 0.0136 0.1238 3.8977 0.1536 1.2047 3.8335 0.2739 0.9499 2.4698 1.3698 2.1088 1.4488 2.1483 0.3981 3.0058 0.5249 2.6425 1.1972 5.1328 15.8743 3.6096 11.9665 1.9132 7.9926 0.8962 4.2288 4.5892 5.9265 10.7707 17.9274 2.4331 2.7190 1.9403 3.1532 23.6920 30.2442 11.4581 7.2119 18.4879 27.5780 10.7609 1.5544 0.9984 23.1538 79.7633 2.8764 7.2300 3.0759 0.2341 13.1292 14.1246 78.9114 19.2830 17.8445 5.5789 22.2846 6.6213 8.1723 23.7086 4.6759 33.4199 4.0915 4.1673 1.1114 7.8342 11.9899 12.3259 83.7543 10.2862 36.5093 10.0966 12.3471 32.0390 16.4329 5.4137 13.2615 0.8785 12.7428 9.7225 2.5003 4.1493 29.1990 4.3494 25.6635 4.7492 4.0408 0.8207 8.6169 3.9515 24.7494 31.6351 7.9694 121.8354 96.1242 64.8181 129.7856 95.6371 73.8162 14.2149 9.7195 11.7403 93.1529 67.4878 30.1345 57.6632 44.1188 10.8617 14.8094 50.3552 41.4508 31.4265 102.8994 18.3929 0.7700 0.4281 8.4947 1.6604
temp: 298.150 k
press: 1.00000 atm
elementType: 53 8 7 6 6 6 6 6 6 6 6 6 6 6 6 6 6 6 6 6 1 1 1 1 1 1 1 1 1 1 1 1 1 1 1 1 1 1 1 1 1 1
symmnumber: 1
zpe: 927162.1 jmol-1
zpe.correction: 0.353137 hartree
zpe.thermalcorrener: 0.371932 hartree
zpe.thermalcorrenthalpy: 0.372876 hartree
zpe.thermalcorrgfe: 0.300680 hartree
zpe.sumelectzpe: -800.960844 hartree
zpe.sumelectthermal: -800.942050 hartree
zpe.sumelectthermalent: -800.941106 hartree
zpe.sumelectthermalfe: -801.013301 hartree
dipole: 1.7416 -1.7683 -1.2787
dipole: 2.7919
quadrupole: -126.9194 -143.0661 -133.2453
quadrupole: -3.1443 -5.4287 -3.5964
quadrupole: 7.4909 -8.6558 1.1650 -3.1443 -5.4287 -3.5964
hfenergy: -801.3139818 hartree
pointgroup: C01 [X(C17H22I1N1O1)]
dipole: 0.667493 -0.5989577 -0.6342288 debye
polarizability: 232.6687145|37.5643513|234.95446|-59.3618418|-23.0018059|182.4000756 unknown
InChI: InChI=1S/C17H22INO/c18-16-5-3-15(4-6-16)17(20)8-10-19-9-7-13-1-2-14(11-13)12-19/h3-6,13-14H,1-2,7-12H2
charge 0 multiplicity 1
42 atoms
I  -4.524732 -2.297609 2.314623
O  -0.787595 3.4950 0.336564
N  1.858544 0.853566 -0.938418
C  2.507649 -1.689858 0.91508
C  3.3233 -1.197722 -1.350309
C  3.80951 -1.442763 0.109568
C  1.698873 -2.593438 -0.064403
C  2.048067 -2.093341 -1.500885
C  1.765172 -0.378479 1.326117
C  3.020599 0.288418 -1.671062
C  2.071607 0.916298 0.535264
C  1.375132 2.132392 -1.51325
C  -0.180383 2.230059 -1.630406
C  -0.889918 2.393037 -0.289484
C  -1.713835 1.274607 0.282392
C  -2.558704 1.559969 1.390127
C  -1.672977 -0.051588 -0.223805
C  -3.357821 0.557434 1.971889
C  -2.461847 -1.070038 0.355144
C  -3.304238 -0.754812 1.443774
H  2.723274 -2.255267 1.842519
H  4.113455 -1.50551 -2.063354
H  4.425642 -0.612069 0.501979
H  4.435781 -2.355929 0.140356
H  0.61329 -2.562393 0.144592
H  2.025152 -3.644539 0.058776
H  2.223696 -2.938526 -2.190963
H  1.223457 -1.483312 -1.912708
H  2.011022 -0.148713 2.383553
H  0.674422 -0.560719 1.293445
H  3.948077 0.889543 -1.481566
H  2.79811 0.363074 -2.753274
H  1.417222 1.708562 0.943696
H  3.119833 1.243531 0.749565
H  1.778458 2.235345 -2.537525
H  1.731883 3.014724 -0.935448
H  -0.399053 3.151887 -2.204067
H  -0.549791 1.3679 -2.207867
H  -2.572297 2.582789 1.781176
H  -0.999794 -0.308435 -1.04748
H  -4.009967 0.791463 2.818059
H  -2.417178 -2.089439 -0.038181
