program: Gaussian 09
title: 000262138
version: EM64L-G09RevD.01
frameworkgroup: C1[X(C17H22FNO)]
method: RPBEPBE
basis: SDD
operation: Freq
keyword: #p
keyword: freq=noraman
keyword: PBEPBE/SDD
title: #p freq=noraman PBEPBE/SDD
converged: YES YES NO NO
title: Mulliken charges:
elementType: F O N C C C C C C C C C C C C C C C C C H H H H H H H H H H H H H H H H H H H H H H
charge: -0.197803 -0.228203 -0.076687 -0.072199 -0.099943 -0.483580 -0.483090 -0.444609 -0.413065 -0.444607 -0.398143 -0.370162 -0.487366 0.079055 0.331507 -0.335410 -0.315214 -0.368009 -0.392698 0.328669 0.211598 0.211449 0.207091 0.210116 0.206221 0.211164 0.210183 0.217230 0.192969 0.215598 0.185484 0.214911 0.231809 0.192942 0.212540 0.231878 0.227031 0.217837 0.284383 0.257608 0.260489 0.261024
chargesum: 0.00000
title: Mulliken charges with hydrogens summed into heavy atoms:
elementType: F O N C C C C C C C C C C C C C C C C C
charge: -0.197803 -0.228203 -0.076687 0.139399 0.111506 -0.066374 -0.065706 -0.017196 -0.004498 -0.044212 0.026609 0.074256 -0.042498 0.079055 0.331507 -0.051027 -0.057607 -0.107520 -0.131673 0.328669
polarizability: 2.15271014e+02 1.61236230e+01 2.00870335e+02 -1.76250865e+01 9.23593194e+00 1.47133996e+02
1716.lowfreq: -13.6920 -7.3931 -0.1896 -0.0011 -0.0009 -0.0008 17.9349 27.4992 33.3403
frequency: 17.4177 27.2362 33.2908 40.1619 71.1781 99.6041 113.1526 159.6998 186.7778 206.8567 270.3017 284.9698 291.1777 315.5468 340.9246 357.1266 372.8580 385.8890 400.9251 410.2845 429.0049 462.5178 475.9733 490.5309 537.8671 564.9155 623.1043 630.7155 648.7424 682.5758 697.6766 746.6299 753.0947 765.7153 792.5254 805.6617 814.0302 820.3422 847.7495 873.9735 883.7961 888.4127 915.6967 938.2086 950.5171 958.3415 982.7644 987.5807 994.5926 1001.7202 1004.5019 1014.4718 1041.4680 1050.7168 1063.9410 1084.4847 1101.6510 1106.1561 1112.0190 1132.5734 1156.2373 1167.6764 1176.2055 1185.5015 1201.8244 1206.8740 1207.0914 1229.0392 1243.6434 1258.7084 1268.2879 1277.6157 1293.3327 1296.3256 1307.1238 1311.1162 1314.2977 1316.5253 1329.2214 1337.1474 1351.6134 1362.0360 1375.6945 1378.1480 1390.5337 1408.0243 1453.8571 1456.1261 1458.6815 1462.0761 1469.0081 1475.3534 1480.4072 1488.1466 1491.2170 1554.1919 1596.5951 1607.1556 2840.1065 2865.5563 2925.4521 2968.2761 2978.0854 2978.7675 2992.9742 2997.9300 3004.9163 3007.2573 3015.1073 3030.2049 3033.8018 3038.2767 3040.6073 3043.8155 3064.0871 3087.5723 3156.6050 3157.0553 3176.3793 3179.6647
redmass: 4.8751 4.6419 4.3404 3.6024 3.9361 5.6414 3.2358 4.3682 2.9067 3.3627 3.9953 2.7911 3.5806 4.2367 3.4271 2.0651 5.4526 2.3894 1.9950 2.7168 2.5515 4.1321 2.4126 2.8981 3.2098 3.3428 6.5551 4.4296 2.7322 2.6426 3.2404 2.8932 2.9631 2.2794 3.9044 3.8822 2.0954 1.3182 1.5524 2.4933 2.0578 2.3047 2.8035 1.8919 1.3914 2.0605 1.7643 1.6078 2.4562 1.9302 2.7359 1.9443 2.2874 2.6335 2.2132 2.1186 1.8482 1.3396 1.4038 1.6432 1.4592 1.5165 1.3076 1.5412 2.0094 1.5004 1.3304 1.3082 1.2847 1.4899 1.7675 1.3950 1.3404 1.3815 1.4024 1.5526 1.2882 1.4882 1.5049 1.3345 1.3729 1.3567 1.6514 2.9189 1.3118 4.0696 1.1625 1.0854 1.0816 1.0842 1.0850 1.0857 1.1121 1.0890 2.3658 8.6092 7.3358 6.7078 1.0701 1.0709 1.0681 1.0667 1.0666 1.0618 1.0746 1.0705 1.0668 1.0825 1.0813 1.0910 1.0987 1.0936 1.0981 1.1014 1.1044 1.0985 1.0886 1.0889 1.0964 1.0975
irintensity: 0.1234 0.4136 1.0657 0.5565 0.8865 4.4905 0.7268 0.2245 3.4636 3.2651 1.3613 0.2171 1.8344 0.6074 1.0610 0.3545 5.2588 1.1144 0.6977 0.7628 0.3924 1.0705 1.3194 19.7832 14.5783 12.6187 1.1587 5.6151 4.3604 3.1542 2.1332 4.2376 6.4297 2.9577 9.0477 9.3170 3.7627 7.9789 65.5155 9.0920 7.4720 15.9228 17.8683 9.8941 0.0940 1.3931 17.7946 3.3530 11.6424 5.5072 8.5240 0.3015 14.2577 50.2065 22.6762 17.5881 5.9554 17.6819 13.6045 7.8387 69.2953 32.3879 3.9131 25.5486 16.9760 3.1097 9.4132 7.6762 13.1397 12.9997 96.5063 9.7340 16.1670 38.3559 19.7256 32.2123 9.0416 4.1216 12.8758 1.0814 14.4215 2.4746 0.6986 12.7165 2.2976 14.9240 22.0071 2.2968 2.8002 6.2916 9.1691 6.6451 37.2332 10.5186 27.0199 123.6622 49.0804 77.3240 120.2497 87.6863 70.3658 13.7219 8.9414 15.4825 90.4574 63.7455 38.8192 54.1375 43.8418 10.7342 9.9938 51.0383 42.9279 32.8277 99.1931 18.2184 1.8867 0.1967 3.1156 5.0971
temp: 298.150 k
press: 1.00000 atm
elementType: 9 8 7 6 6 6 6 6 6 6 6 6 6 6 6 6 6 6 6 6 1 1 1 1 1 1 1 1 1 1 1 1 1 1 1 1 1 1 1 1 1 1
symmnumber: 1
zpe: 933012.4 jmol-1
zpe.correction: 0.355366 hartree
zpe.thermalcorrener: 0.373305 hartree
zpe.thermalcorrenthalpy: 0.374250 hartree
zpe.thermalcorrgfe: 0.307234 hartree
zpe.sumelectzpe: -889.296218 hartree
zpe.sumelectthermal: -889.278278 hartree
zpe.sumelectthermalent: -889.277334 hartree
zpe.sumelectthermalfe: -889.344350 hartree
dipole: 2.4870 -0.5413 -1.2614
dipole: 2.8406
quadrupole: -118.5437 -128.7225 -117.0726
quadrupole: -0.0044 -1.7980 -4.8993
quadrupole: 2.9026 -7.2763 4.3737 -0.0044 -1.7980 -4.8993
hfenergy: -889.6515838 hartree
pointgroup: C01 [X(C17H22F1N1O1)]
dipole: 0.7405478 -0.477513 -0.6874456 debye
polarizability: 197.7345429|6.9120012|198.9524481|-39.1137456|-5.6000415|166.588354 unknown
InChI: InChI=1S/C17H22FNO/c18-16-5-3-15(4-6-16)17(20)8-10-19-9-7-13-1-2-14(11-13)12-19/h3-6,13-14H,1-2,7-12H2
charge 0 multiplicity 1
42 atoms
F  -4.071152 -1.870615 2.047447
O  -0.918917 3.447858 0.353365
N  1.796467 0.874509 -0.935637
C  2.546091 -1.655353 0.903356
C  3.345973 -1.113133 -1.355565
C  3.838264 -1.346445 0.10382
C  1.779364 -2.585951 -0.084549
C  2.109296 -2.059516 -1.516041
C  1.746788 -0.3792 1.319441
C  2.98375 0.36143 -1.667227
C  2.000967 0.933665 0.539683
C  1.274007 2.142767 -1.501164
C  -0.283578 2.195597 -1.611996
C  -0.993774 2.341227 -0.268772
C  -1.786357 1.20349 0.307236
C  -2.639143 1.474832 1.414772
C  -1.705943 -0.124164 -0.195353
C  -3.409647 0.455663 2.002764
C  -2.46366 -1.161835 0.387779
C  -3.303379 -0.84339 1.468952
H  2.78311 -2.216723 1.828024
H  4.149987 -1.383233 -2.068355
H  4.415066 -0.491763 0.504022
H  4.504475 -2.230996 0.131445
H  0.69286 -2.603666 0.121751
H  2.150334 -3.62301 0.031634
H  2.320233 -2.89059 -2.213312
H  1.260428 -1.480545 -1.923296
H  1.978026 -0.1466 2.379557
H  0.665043 -0.607738 1.280538
H  3.885327 0.998428 -1.469896
H  2.762274 0.434653 -2.749741
H  1.311579 1.693814 0.951305
H  3.033177 1.304028 0.761742
H  1.670788 2.261788 -2.526172
H  1.608096 3.032039 -0.920161
H  -0.530914 3.110387 -2.185277
H  -0.630412 1.323159 -2.188085
H  -2.676901 2.500374 1.795692
H  -1.023869 -0.360192 -1.017386
H  -4.076382 0.646942 2.848365
H  -2.41014 -2.190786 0.020995
