program: Gaussian 09
title: 000262133
version: EM64L-G09RevD.01
frameworkgroup: C1[X(C19H29NO)]
method: RPBEPBE
basis: SDD
operation: Freq
keyword: #p
keyword: freq=noraman
keyword: PBEPBE/SDD
title: #p freq=noraman PBEPBE/SDD
converged: NO YES NO NO
title: Mulliken charges:
elementType: O N C C C C C C C C C C C C C C C C C C C H H H H H H H H H H H H H H H H H H H H H H H H H H H H H
charge: -0.490936 -0.197182 -0.050567 -0.105090 -0.482951 -0.484381 -0.452533 -0.463976 -0.409465 -0.337333 -0.391200 -0.490156 -0.181322 0.422436 -0.408301 -0.411251 -0.405144 -0.416812 0.490530 -0.534876 -0.674472 0.207300 0.211875 0.211364 0.206886 0.219147 0.231988 0.225230 0.213980 0.209517 0.198535 0.231374 0.191400 0.198390 0.205230 0.200099 0.243709 0.213672 0.245925 0.178458 0.406834 0.282480 0.221200 0.225656 0.225394 0.207855 0.205594 0.220699 0.212810 0.222376
chargesum: 0.00000
title: Mulliken charges with hydrogens summed into heavy atoms:
elementType: O N C C C C C C C C C C C C C C C C C C C
charge: -0.084102 -0.197182 0.156734 0.106785 -0.064701 -0.033245 -0.013322 -0.055924 0.013309 0.066288 0.052608 -0.030559 -0.002864 0.422436 -0.125821 -0.190051 -0.179488 -0.191418 0.490530 -0.121426 -0.018587
polarizability: 2.80321313e+02 5.25367635e+00 1.63831578e+02 1.39023288e-01 -1.74838247e+00 1.89510063e+02
1716.lowfreq: -24.5716 -14.6668 -7.0936 -0.0007 -0.0005 -0.0003 10.7284 20.8153 26.7622
frequency: -22.0604 19.6756 26.6113 39.3047 58.8264 67.6571 107.1434 130.2662 140.1301 162.9119 192.6576 204.7628 223.0070 242.3775 284.4414 290.2850 310.6568 342.5873 350.9421 366.2364 375.8649 401.3679 411.1372 428.3677 452.6977 470.0718 521.5610 537.5729 585.0759 612.1136 637.7621 674.9518 702.0011 710.8601 745.9143 757.9069 771.0648 776.1695 781.2610 800.3993 816.3626 832.1260 856.3005 861.1570 868.5511 884.1658 898.5167 926.4829 941.5404 949.0881 953.0805 961.8420 967.3685 981.7743 987.6166 1004.0114 1005.9248 1015.0236 1033.8745 1036.5928 1041.8365 1061.5787 1069.6485 1078.7963 1085.5833 1103.5894 1117.4722 1122.7743 1129.4573 1171.9785 1180.8106 1186.9387 1201.6162 1205.8560 1210.1738 1215.2590 1218.7966 1226.4693 1232.8331 1240.3660 1253.0668 1267.4928 1272.8001 1291.1558 1302.3833 1304.6506 1310.2319 1311.7768 1317.6444 1323.2856 1324.4014 1334.6391 1339.8631 1352.3672 1367.3652 1373.5823 1384.0679 1385.9502 1392.6994 1406.5256 1450.2090 1455.8799 1456.6217 1462.9404 1466.3143 1469.8268 1471.6503 1472.6041 1478.2692 1487.3905 1488.4323 1492.0807 1510.6323 1584.2742 1624.9377 2861.6198 2890.0823 2897.2322 2906.0457 2963.2365 2968.6999 2976.2246 2976.8798 2982.8415 2985.2637 2992.1929 2996.1204 3001.0622 3016.1612 3020.0304 3028.4244 3032.7837 3033.2159 3039.6709 3042.4520 3048.3127 3061.3395 3071.2728 3074.2830 3081.1878 3099.3275 3112.2904 3125.7954 3168.3876
redmass: 2.4800 3.6840 3.8418 3.6730 4.3191 4.2462 2.3759 3.0427 2.8438 3.1923 1.9328 2.0378 1.8067 2.7838 3.0172 2.9671 2.2033 2.5941 2.9044 2.3365 3.1140 3.1623 3.5760 1.9211 3.3518 2.4074 3.6956 2.8850 2.5990 3.5344 6.6660 3.0672 2.4857 3.2483 2.6367 2.5395 1.6122 3.0664 1.1635 3.5089 2.3447 1.5206 1.9180 1.6938 2.7135 1.9183 2.2029 1.9610 1.4400 1.4329 1.5531 2.0648 2.3524 1.7488 1.5683 2.3321 1.9443 2.7097 2.1813 1.7520 1.7749 2.0624 2.6334 2.3589 3.1811 1.4693 1.6743 1.4050 1.7785 1.4024 1.1502 1.2427 1.4248 1.3673 2.0716 2.2140 1.5343 1.1914 1.3372 1.2608 1.3182 1.3476 1.2509 1.3272 1.3724 1.2221 1.5289 1.4871 1.5346 1.3223 1.2420 1.3429 1.4580 1.3477 1.3339 1.2824 1.2222 4.3146 1.3515 2.7060 1.1895 1.0941 1.0911 1.0891 1.0893 1.0437 1.0820 1.0700 1.1051 1.1190 1.0917 1.1615 2.4239 6.7422 6.4777 1.0709 1.0809 1.0702 1.0701 1.0637 1.0672 1.0352 1.0683 1.0594 1.0705 1.0612 1.0684 1.0734 1.0824 1.0844 1.0987 1.0898 1.1016 1.0962 1.1003 1.1009 1.0970 1.1036 1.1000 1.1011 1.0865 1.0900 1.0963 1.0936
irintensity: 0.0898 0.4213 0.1921 0.2148 1.5056 1.5363 0.5760 1.3205 0.6153 2.3985 0.3842 2.1297 0.5870 0.4653 1.2698 0.0669 2.6046 0.7052 0.7682 0.3693 2.2407 0.4011 0.7181 8.2663 1.8109 2.5649 6.4964 3.1343 21.2115 2.9901 0.4854 3.6913 5.4956 6.6426 1.7279 1.7489 4.3699 1.9644 2.2704 1.3364 4.4369 38.8335 7.9424 14.8740 6.3253 8.0460 17.1205 7.7226 60.5847 1.1621 44.1026 2.0882 6.6843 10.2217 5.1453 12.4415 3.0309 6.2189 24.9409 6.2748 1.6678 19.5465 5.9310 26.3893 17.6954 5.1864 17.0250 11.3830 8.6119 1.7109 5.7669 2.4520 1.8186 1.8409 9.1845 0.0659 4.6933 11.8200 12.8798 0.1905 2.5073 11.5210 6.5879 1.4432 8.2295 0.8312 3.1118 3.3690 0.2745 2.3183 8.3586 0.8885 3.9622 3.5458 4.4445 2.6303 10.1878 4.9252 2.3740 8.1569 58.9365 18.5038 17.0450 9.7889 0.4874 14.0759 8.6345 2.2608 0.6263 18.7070 21.6361 53.8137 14.3894 0.6905 0.3530 137.6511 86.9646 66.9008 207.4495 200.5600 445.7026 39.1378 12.7823 36.1413 12.8050 30.2311 72.7060 86.4451 69.5572 36.6589 28.8864 38.9220 9.4981 2.9007 41.3956 2.0196 51.2882 77.6060 64.4702 40.9702 20.0447 29.5508 23.5203 2.8371
temp: 298.150 k
press: 1.00000 atm
elementType: 8 7 6 6 6 6 6 6 6 6 6 6 6 6 6 6 6 6 6 6 6 1 1 1 1 1 1 1 1 1 1 1 1 1 1 1 1 1 1 1 1 1 1 1 1 1 1 1 1 1
symmnumber: 1
zpe: 1160606.7 jmol-1
zpe.correction: 0.442052 hartree
zpe.thermalcorrener: 0.461441 hartree
zpe.thermalcorrenthalpy: 0.462386 hartree
zpe.thermalcorrgfe: 0.393078 hartree
zpe.sumelectzpe: -869.749792 hartree
zpe.sumelectthermal: -869.730402 hartree
zpe.sumelectthermalent: -869.729458 hartree
zpe.sumelectthermalfe: -869.798766 hartree
dipole: 2.5247 1.8053 1.9116
dipole: 3.6452
quadrupole: -115.2566 -128.9845 -124.9530
quadrupole: 1.8980 -0.0487 -2.1317
quadrupole: 7.8081 -5.9197 -1.8883 1.8980 -0.0487 -2.1317
hfenergy: -870.1918437 hartree
pointgroup: C01 [X(C19H29N1O1)]
dipole: 1.0222711 -0.1203713 -0.9986172 debye
polarizability: 280.2998708|-5.2087273|175.1649385|-0.4127481|-12.9670452|178.1981448 unknown
InChI: InChI=1S/C19H29NO/c1-2-15-5-7-18(8-6-15)19(21)10-12-20-11-9-16-3-4-17(13-16)14-20/h5-8,16-17,19,21H,2-4,9-14H2,1H3
charge 0 multiplicity 1
50 atoms
O  0.184595 -0.395402 0.888677
N  2.331975 -0.703834 -0.706832
C  4.643763 0.060946 1.213183
C  3.742197 1.453184 -0.601867
C  5.058917 0.809169 -0.084897
C  3.532363 0.977653 1.834636
C  3.067497 1.955887 0.708487
C  4.166912 -1.397185 0.947492
C  2.838391 0.505373 -1.426154
C  3.441633 -1.660901 -0.391885
C  1.237115 -1.380534 -1.488166
C  -0.067344 -0.549574 -1.598868
C  -0.4172 0.240464 -0.281423
C  -1.923078 0.357632 -0.084514
C  -2.592134 -0.412124 0.8957
C  -2.684897 1.227252 -0.904307
C  -3.994656 -0.321594 1.040428
C  -4.08639 1.312358 -0.757446
C  -4.767374 0.53529 0.215396
C  -6.283879 0.594576 0.342159
C  -6.995679 -0.418398 -0.595104
H  5.501365 -0.002057 1.910439
H  3.970987 2.302727 -1.276744
H  5.77582 1.615767 0.164178
H  5.550278 0.156321 -0.831219
H  3.932957 1.540033 2.69823
H  2.687433 0.374346 2.210175
H  1.96659 1.987177 0.623435
H  3.407421 2.985679 0.926819
H  3.508481 -1.710217 1.781341
H  5.044074 -2.076848 0.966158
H  1.96119 1.086249 -1.76521
H  3.392005 0.183398 -2.344439
H  4.177016 -1.66446 -1.230723
H  3.012198 -2.679863 -0.349182
H  1.589076 -1.65944 -2.509423
H  1.006442 -2.314832 -0.947609
H  -0.020841 0.161504 -2.445935
H  -0.882189 -1.260786 -1.830159
H  -0.002653 1.270447 -0.392005
H  1.169069 -0.487204 0.619813
H  -1.992339 -1.055056 1.546318
H  -2.180966 1.850328 -1.6552
H  -4.49773 -0.918686 1.812238
H  -4.658955 1.997273 -1.39623
H  -6.582279 0.387365 1.387844
H  -6.642053 1.615131 0.104728
H  -6.740872 -0.221056 -1.652361
H  -8.094548 -0.355507 -0.486966
H  -6.684205 -1.453172 -0.363609
