program: Gaussian 09
title: 000262101
version: EM64L-G09RevD.01
frameworkgroup: C1[X(C8H9N3O)]
method: RPBEPBE
basis: SDD
operation: Freq
keyword: #pfreq=noraman
keyword: PBEPBE/SDD
title: #p freq=noraman PBEPBE/SDD
converged: NO NO NO NO
title: Mulliken charges:
elementType: O N N N C C C C C C C C H H H H H H H H H
charge: -0.186819 -0.264868 -0.071035 0.002044 0.438434 0.204098 -0.534855 -0.737260 0.237529 -0.759385 -0.540579 -0.131955 0.270023 0.259546 0.259537 0.229624 0.247856 0.233385 0.247887 0.298407 0.298386
chargesum: 0.00000
title: Mulliken charges with hydrogens summed into heavy atoms:
elementType: O N N N C C C C C C C C
charge: -0.186819 -0.264868 -0.071035 0.002044 0.438434 0.204098 -0.264833 0.011448 0.237529 -0.030257 0.056214 -0.131955
polarizability: 1.51861379e+02 -1.02162664e+01 1.10192923e+02 7.16949890e-03 -5.19304204e-03 5.78200499e+01
1716.lowfreq: -113.3674 -11.4085 -11.3020 -0.0011 -0.0010 -0.0008 9.5110 37.8298 80.0085
frequency: -113.3641 37.8103 79.9780 98.5515 133.7317 159.6902 193.6983 194.3770 255.6666 321.4045 345.1740 357.3595 387.4570 441.3075 513.2239 540.0518 577.2044 641.3892 656.8361 734.0471 791.1058 839.3172 908.9789 927.5011 969.1161 979.8143 1011.3796 1022.5278 1043.9194 1046.1326 1109.9217 1161.6714 1185.3624 1234.9443 1298.8595 1351.4028 1394.4833 1400.3657 1408.4007 1412.2125 1448.5503 1453.4131 1464.2521 1470.1176 1481.6545 1575.4586 1640.4085 2222.6893 2997.8299 2999.5491 3016.5057 3065.7840 3081.5300 3081.7160 3108.3127 3109.1715 3235.5175
redmass: 1.0244 5.1747 3.5582 6.6007 3.7135 1.2855 5.8112 2.2648 3.0753 4.3697 3.7664 3.2376 7.0452 7.6846 4.0991 3.5534 4.3150 6.1168 3.1647 5.7704 5.7451 1.2887 7.2120 2.4597 2.4323 1.6197 2.2405 2.9278 1.5258 1.4985 5.1431 1.6200 1.1146 3.2337 2.3704 4.0220 2.7252 1.3217 1.1401 1.1960 1.8867 1.0433 1.0443 2.1828 1.1814 5.7009 9.8130 12.4698 1.0372 1.0366 1.0607 1.0972 1.0972 1.0979 1.1008 1.0993 1.0994
irintensity: 0.4027 1.9135 13.6872 2.4383 4.3071 3.8173 2.0983 0.0982 3.3286 6.0213 0.2170 0.9291 7.2567 1.1270 0.9281 3.2327 2.1551 0.0872 2.7168 24.8233 1.2698 28.5725 83.5666 3.5345 27.1125 2.1958 11.7999 0.4611 11.0968 3.1011 3.1488 13.7902 0.0318 31.9481 52.8886 321.7484 73.0592 30.9386 72.6760 10.8942 26.2311 15.3056 17.2648 59.4335 16.7912 28.3449 233.8941 6.1921 18.7921 8.4430 2.0224 0.1677 1.1031 18.2087 15.3957 17.8162 1.5540
temp: 298.150 k
press: 1.00000 atm
elementType: 8 7 7 7 6 6 6 6 6 6 6 6 1 1 1 1 1 1 1 1 1
symmnumber: 1
zpe: 416413.1 jmol-1
zpe.correction: 0.158603 hartree
zpe.thermalcorrener: 0.170008 hartree
zpe.thermalcorrenthalpy: 0.170952 hartree
zpe.thermalcorrgfe: 0.120493 hartree
zpe.sumelectzpe: -548.831826 hartree
zpe.sumelectthermal: -548.820422 hartree
zpe.sumelectthermalent: -548.819478 hartree
zpe.sumelectthermalfe: -548.869937 hartree
dipole: 6.8975 -0.5850 0.0012
dipole: 6.9222
quadrupole: -88.2245 -65.6495 -69.1573
quadrupole: 2.2702 0.0001 -0.0016
quadrupole: -13.8807 8.6943 5.1865 2.2702 0.0001 -0.0016
hfenergy: -548.9904297 hartree
pointgroup: C01 [X(C8H9N3O1)]
dipole: 2.7138661 0.227769 -0.005768 debye
dipolederiv: -0.9048338 -0.109575 0.0011074 -0.4298307 -0.7945341 -0.0000996 0.0004911 -0.0007349 -0.2774424 -1.7626276 -0.1945244 0.0032962 0.0374245 -0.2979433 -0.0005023 0.0037287 -0.0001318 -0.0272873 -0.1898304 0.2044748 0.000431 0.4330078 -0.3118859 -0.0012386 0.0009136 -0.0006384 -0.1900639 -0.2934574 0.0530724 0.0002098 0.0189489 -0.2027256 -0.0000032 0.0001793 -0.0000778 -0.2258544 0.7208982 0.163543 -0.001101 -0.3038325 0.352969 0.001296 -0.0019813 0.0004032 -0.0017468 0.0964495 0.0194302 -0.0002973 0.5203288 0.6738459 -0.0000478 -0.0001621 0.0004658 0.0160913 -0.3280637 -0.2432576 -0.0003078 -0.4654248 -0.4633194 0.0005248 -0.0007184 0.0001834 -0.2226986 0.0594499 -0.1394025 -0.0002845 -0.0260091 -0.1533841 -0.0003701 -0.0000814 -0.000136 0.0622659 2.2286923 0.088729 -0.0041445 0.0188874 1.0604597 0.0016416 -0.0042305 0.0014538 0.193794 0.0261195 -0.0541592 0.000105 -0.2055558 -0.1273441 0.0001655 0.0014075 0.0007422 0.0405238 -0.021491 0.0610468 0.0005439 0.2440901 -0.1972569 -0.0012436 0.0008944 -0.0008787 0.176659 0.1881112 -0.0100131 -0.0004702 0.0109988 -0.049909 -0.0000433 -0.000449 0.0000006 -0.0344169 -0.0098418 0.0647319 0.0005226 0.0661117 0.0796539 -0.0003891 0.0004805 -0.0003904 0.1943798 0.0686109 -0.0286305 0.0864617 -0.0109888 0.047098 0.0067438 0.0740974 0.0412954 -0.0098977 0.0679353 -0.0284559 -0.0869017 -0.0107298 0.0472856 -0.0064781 -0.0744648 -0.0409497 -0.0094252 -0.0818619 0.1438684 0.0007045 0.0550408 0.0155081 -0.0003211 0.0005278 -0.0005081 0.1201824 0.0603079 -0.0014073 0.0504942 -0.0345269 0.0179292 -0.089503 -0.0034186 -0.1210477 -0.0225111 -0.1089985 0.0227578 -0.0005501 0.1107708 0.054762 0.0002999 -0.0007187 -0.0000752 0.1204007 0.06033 -0.0024593 -0.0497875 -0.0353177 0.0182371 0.0893624 0.0034765 0.1207811 -0.0235415 0.0619433 -0.0049415 -0.0259169 0.0033075 0.1154363 -0.0328639 -0.0352462 -0.0469224 0.0602856 0.0621581 -0.0048281 0.0258852 0.0032993 0.1151175 0.0330697 0.0352741 0.0471655 0.0603032 unknown
polarizability: 151.8789968|10.1796869|110.1747577|-0.1861063|0.0759751|57.8205974 unknown
InChI: InChI=1S/C8H9N3O/c1-6-5-7(2)11(10-6)8(12)3-4-9/h5H,3H2,1-2H3
charge 0 multiplicity 1
21 atoms
O  -1.599472 -1.47147 0.002253
N  0.367042 -0.211227 0.000523
N  0.932694 1.091409 0.001986
N  -4.435225 0.73339 0.01278
C  1.356153 -1.221855 -0.003489
C  2.271275 0.873057 -0.001153
C  2.571656 -0.538206 -0.004572
C  1.070996 -2.69406 -0.00579
C  -1.043446 -0.349099 0.003174
C  3.235543 2.028017 -0.001116
C  -1.789282 0.996661 0.007413
C  -3.247774 0.826464 0.01026
H  3.55929 -0.993457 -0.007452
H  0.481899 -2.997033 0.877157
H  0.478214 -2.993541 -0.887458
H  2.023507 -3.248541 -0.008864
H  3.087435 2.666788 0.88725
H  4.276584 1.667493 0.001579
H  3.091235 2.663686 -0.892386
H  -1.467281 1.587115 0.885071
H  -1.471144 1.590509 -0.869367
