program: Gaussian 09
title: 000262102
version: EM64L-G09RevD.01
frameworkgroup: C1[X(C9H11ClO)]
method: RPBEPBE
basis: SDD
operation: Freq
keyword: #p
keyword: freq=noraman
keyword: PBEPBE/SDD
title: #p freq=noraman PBEPBE/SDD
converged: NO NO NO NO
title: Mulliken charges:
elementType: Cl O C C C C C C C C C H H H H H H H H H H H
charge: -0.074536 -0.425975 0.156432 0.452049 0.344599 -0.091218 -0.305397 -0.352584 -0.814580 -0.828016 -0.811517 0.257827 0.251322 0.251398 0.188521 0.251523 0.251527 0.236145 0.270895 0.226286 0.226352 0.338951
chargesum: 0.00000
title: Mulliken charges with hydrogens summed into heavy atoms:
elementType: Cl O C C C C C C C C C
charge: -0.074536 -0.087025 0.156432 0.452049 0.344599 -0.091218 -0.305397 -0.094758 -0.123340 -0.088822 -0.087985
polarizability: 1.43179143e+02 -1.26793436e+00 1.28521208e+02 -9.39277762e-03 2.20277924e-03 5.80252680e+01
1716.lowfreq: -77.4526 -41.3195 -0.0029 -0.0025 -0.0019 7.4137 10.2264 10.9707 86.8966
frequency: -77.3846 -40.6925 86.6880 98.3506 150.0786 165.2491 215.4995 255.8201 285.3427 308.6005 332.6045 359.8385 363.0877 382.2211 459.3920 511.8909 514.3885 555.0507 601.5342 669.1882 734.7454 754.5761 878.2568 885.6666 962.1621 1010.0923 1014.7756 1019.4781 1042.8081 1048.2589 1074.9631 1153.3287 1218.8649 1222.7455 1298.5856 1366.7107 1388.8155 1397.3996 1401.5425 1414.7429 1457.2928 1459.1037 1468.3391 1476.1021 1481.8805 1483.6530 1498.9965 1581.3010 1617.3150 2973.2951 2980.8274 2985.8236 3048.2399 3053.7819 3056.8443 3062.8745 3112.0087 3120.0917 3148.6489 3597.5809
redmass: 1.0193 1.0819 1.6077 3.0598 2.1710 2.2065 6.5126 1.5377 2.9678 1.9364 3.8487 6.1217 6.1567 3.4874 5.0005 5.0066 3.3091 3.1031 4.9893 5.7480 4.4997 4.1537 1.3290 3.1108 2.6163 1.4967 1.4192 1.4097 1.5320 1.5182 2.2617 1.6953 3.9300 1.7895 3.5157 5.6713 1.6463 1.6374 1.2573 1.4867 1.0438 1.6697 1.3868 1.4404 1.0437 1.0464 1.1183 6.2041 6.7296 1.0376 1.0392 1.0390 1.0956 1.0977 1.0970 1.0992 1.0965 1.0963 1.0926 1.0649
irintensity: 0.0548 0.5612 2.7310 1.6434 2.7292 0.5695 0.5122 73.2767 6.0233 52.9609 0.9845 0.0714 2.9865 3.9103 0.1085 6.5624 0.6743 15.1330 0.0001 21.3420 4.0208 15.4810 15.1472 15.9771 2.2054 42.9644 25.4484 8.4272 1.6560 4.6670 55.3935 158.3119 31.5023 13.5786 7.2503 7.5513 31.4197 26.5910 20.7600 17.0541 24.6758 7.2196 29.0581 8.0315 0.1182 15.5059 62.0411 0.9102 2.2405 39.4348 32.1277 19.4089 36.9377 21.2406 13.8412 13.5109 19.0294 4.5143 2.7559 23.6805
temp: 298.150 k
press: 1.00000 atm
elementType: 17 8 6 6 6 6 6 6 6 6 6 1 1 1 1 1 1 1 1 1 1 1
symmnumber: 1
zpe: 456180.0 jmol-1
zpe.correction: 0.173750 hartree
zpe.thermalcorrener: 0.184456 hartree
zpe.thermalcorrenthalpy: 0.185400 hartree
zpe.thermalcorrgfe: 0.137523 hartree
zpe.sumelectzpe: -884.023449 hartree
zpe.sumelectthermal: -884.012743 hartree
zpe.sumelectthermalent: -884.011799 hartree
zpe.sumelectthermalfe: -884.059676 hartree
dipole: 1.5291 2.5670 -0.0043
dipole: 2.9879
quadrupole: -76.1310 -61.5630 -75.1035
quadrupole: 1.5030 -0.0182 -0.0079
quadrupole: -5.1985 9.3695 -4.1710 1.5030 -0.0182 -0.0079
hfenergy: -884.1971988 hartree
pointgroup: C01 [X(C9H11Cl1O1)]
dipole: -0.3303469 -1.1239903 0.0969662 debye
dipolederiv: -0.6651839 -0.2876731 0.0456756 -0.2965238 -0.3147409 0.0298659 0.0464911 0.0295603 -0.0852031 -1.1212757 -0.5073456 0.0671477 -0.509459 -0.3932757 0.0208092 0.0675288 0.0207734 -0.4059425 -0.1997906 -0.1073977 0.0126293 0.0475881 0.1837922 -0.0224738 0.0010039 -0.0161049 -0.0862197 0.0392152 -0.1737992 0.0119058 -0.2025324 -0.0106805 0.0094105 0.0141919 0.0081831 0.003663 0.1022688 -0.1259943 0.0027535 -0.3704341 0.0847552 0.0036944 0.0211788 -0.0063459 -0.0636063 0.8611684 0.5313161 -0.0727142 0.5946363 0.1919393 -0.0349217 -0.077231 -0.032175 0.0554267 0.7654339 0.4674648 -0.0716992 0.5482741 0.246311 -0.0502307 -0.0780407 -0.0470499 -0.1130791 -0.1749435 -0.0501709 0.0059535 -0.0679481 -0.06548 -0.0018671 0.0072018 -0.0023779 -0.126134 0.0807203 0.0516806 -0.0041786 0.0236975 -0.1085686 0.0128261 -0.0022923 0.0117766 0.0721485 -0.1716179 0.08315 0.0028543 0.047029 0.0725314 -0.003358 0.0055703 -0.0045984 0.0541018 -0.0739843 0.0254916 0.0043624 0.1128392 -0.0672003 0.0065963 -0.002476 0.0103213 0.0785861 0.0990651 0.0016453 0.0021541 0.0051195 -0.0543952 0.015664 0.0019593 0.0157051 0.1537989 0.0627253 0.0660473 0.0844645 0.0272951 -0.0169911 -0.0462889 0.0637622 -0.0943924 -0.0249636 0.0498571 0.0592648 -0.1007517 0.02033 0.0033008 0.0410271 -0.0740724 0.0859903 -0.0322507 -0.2049298 -0.1404415 0.0228215 -0.039099 0.058479 0.0049532 0.0151371 0.0089363 0.1016658 0.0085232 0.0330569 0.0722541 0.006346 0.0783999 0.0510825 0.1045763 0.0057781 -0.0397041 -0.0061535 0.0206247 -0.0787137 -0.0139916 0.0672642 -0.0656324 -0.1064428 -0.022972 -0.0143284 0.1008377 -0.0633192 0.0045358 0.0179249 -0.1465807 0.0174601 -0.0014451 0.020685 0.0956195 -0.0301095 -0.037408 0.0090454 -0.1169004 0.0800799 0.0078266 0.015159 0.0044326 0.1162966 0.0448077 0.0237556 -0.0283403 0.058867 -0.0218045 -0.1153708 0.0302461 -0.1344988 -0.0261899 0.0434414 0.0382908 0.0160022 0.0622512 0.0153347 0.1038994 -0.0469918 0.1255147 -0.0620589 0.3899247 0.0917611 -0.0081618 0.0446906 0.11753 0.0150282 -0.0050146 0.0128585 0.3483735 unknown
polarizability: 142.741433|2.1645143|128.4021602|-3.5905845|-5.4256379|58.5820257 unknown
InChI: InChI=1S/C9H11ClO/c1-5-4-8(10)6(2)7(3)9(5)11/h4,11H,1-3H3
charge 0 multiplicity 1
22 atoms
Cl 2.818696 1.729198 -0.257698
O  -2.557693 -0.947515 0.163567
C  -0.081536 -1.18845 0.082044
C  1.192999 -0.551771 -0.017593
C  -1.224639 1.026975 -0.039803
C  -1.263835 -0.388821 0.06933
C  1.209073 0.858176 -0.125536
C  0.042739 1.639732 -0.137641
C  -0.158586 -2.706863 0.199764
C  2.495223 -1.33374 -0.011267
C  -2.493307 1.860429 -0.051437
H  0.112063 2.729351 -0.223009
H  0.296976 -3.20345 -0.676658
H  0.368039 -3.068821 1.101912
H  -1.191414 -3.097927 0.270311
H  3.06998 -1.143446 -0.936787
H  3.140585 -1.012139 0.827372
H  2.33592 -2.41902 0.076033
H  -3.384563 1.22175 0.034911
H  -2.499663 2.58158 0.787597
H  -2.573628 2.444612 -0.987592
H  -2.510931 -1.931142 0.233577
