program: Gaussian 09
title: 000262169
version: EM64L-G09RevD.01
frameworkgroup: C1[X(C17H15N3O7)]
method: RPBEPBE
basis: SDD
operation: Freq
keyword: #p
keyword: freq=noraman
keyword: PBEPBE/SDD
title: #p freq=noraman PBEPBE/SDD
converged: YES YES NO NO
title: Mulliken charges:
elementType: O O O O O O O N N N C C C C C C C C C C C C C C C C C H H H H H H H H H H H H H H H
charge: -0.295183 -0.244966 -0.189200 -0.172437 -0.212061 -0.193241 -0.187392 -0.229388 -0.008404 0.023624 -0.171246 0.387635 0.242524 0.363794 -0.278843 0.244322 -0.526455 -0.409557 0.429424 -0.342404 -0.338033 -0.775595 -0.210045 -0.225159 0.303029 -0.237235 -0.757279 0.340122 0.274195 0.334004 0.294856 0.270151 0.261875 0.250487 0.262855 0.251159 0.235434 0.240302 0.237946 0.240661 0.264287 0.251439
chargesum: 0.00000
title: Mulliken charges with hydrogens summed into heavy atoms:
elementType: O O O O O O O N N N C C C C C C C C C C C C C C C C C
charge: -0.295183 -0.244966 -0.189200 -0.172437 -0.212061 -0.193241 -0.187392 -0.229388 -0.008404 0.023624 0.168876 0.387635 0.242524 0.363794 -0.004648 0.244322 -0.192451 -0.114701 0.429424 -0.072254 -0.076158 -0.011095 0.025389 0.015143 0.303029 0.000711 -0.000892
polarizability: 2.79332783e+02 -1.80645112e+01 2.20670786e+02 -2.01458200e+01 -1.98143194e+01 2.12993780e+02
1716.lowfreq: -6.0798 -0.0001 0.0005 0.0007 3.7514 6.4998 20.5538 25.9787 27.4591
frequency: 20.4787 25.8758 27.3747 38.9073 51.3160 53.6235 58.5713 67.3233 72.7290 77.8609 81.0286 89.1860 130.6478 131.3634 152.4882 153.0791 171.2142 183.5787 217.3380 246.0902 278.8840 285.4879 305.5022 313.5106 343.9685 382.5810 409.7687 414.0300 418.3508 447.7554 451.5611 499.2452 505.6114 516.7786 553.4919 568.6868 580.5788 593.5319 601.6728 624.5143 639.0018 649.1663 665.7165 680.8521 707.1971 711.8564 724.9475 752.0435 760.6033 785.6841 807.5364 851.9040 862.8114 867.2943 877.4942 888.2109 935.9384 957.0643 973.2857 981.6408 988.2963 989.5834 1000.3841 1005.5555 1013.0355 1026.4518 1037.4876 1039.3077 1054.6525 1075.7654 1088.3697 1111.9179 1142.6466 1174.2504 1180.7938 1181.6265 1192.1975 1207.3903 1218.2140 1253.1245 1259.6602 1271.7743 1309.6733 1316.6178 1342.4122 1361.5530 1374.9905 1377.7079 1383.4871 1385.6846 1400.4072 1415.3982 1438.5860 1448.6864 1451.3403 1453.8052 1463.8446 1470.4943 1482.1602 1588.0259 1590.3302 1600.4246 1612.0427 1613.9567 1669.8587 3003.8926 3006.5009 3027.4402 3092.6682 3097.4787 3132.8611 3133.8693 3138.9983 3141.3601 3150.7920 3159.9112 3171.9639 3178.6102 3191.2434 3195.7915
redmass: 5.7064 8.9581 8.0862 7.0146 10.2972 4.5304 2.6347 4.8650 4.4642 1.3859 5.6124 3.8865 1.1901 4.9424 6.0853 11.6369 6.5333 7.9929 7.1541 4.7450 5.7299 5.8991 6.2791 7.2525 10.5040 5.1013 4.8279 3.1331 4.3145 5.2588 4.7950 6.7799 4.2329 4.4334 3.4970 3.6525 5.3676 4.8285 5.4716 5.4931 6.2896 6.6798 7.4504 9.6698 2.6392 3.3605 6.1879 2.9288 6.9678 2.5034 4.8791 3.7577 1.3629 8.4644 1.5688 8.2858 1.3932 1.4804 3.2041 2.1801 1.4049 4.6797 1.6301 1.5343 1.5411 1.9808 1.6901 1.6771 2.4631 1.7648 2.4033 3.7486 1.5007 1.0595 2.3050 1.2375 2.3769 7.6152 10.3673 2.7482 1.8278 2.9003 1.4889 1.4422 1.7150 5.5734 8.4774 6.1709 1.2729 1.2349 8.3261 5.7312 2.1129 1.1017 1.0555 1.0532 1.0628 2.8535 2.3882 9.0235 6.4183 7.0226 7.3363 7.1454 9.9793 1.0374 1.0377 1.0810 1.0969 1.0955 1.0857 1.1000 1.0887 1.1017 1.0930 1.0965 1.1016 1.0892 1.0923 1.0961
irintensity: 0.2921 0.4734 0.9334 0.5386 0.2659 0.5496 3.1113 0.1559 0.0751 1.0863 1.4619 4.7736 0.4497 2.3179 3.0585 3.5294 1.4880 6.3712 6.3982 1.0657 0.0355 0.5250 1.7798 0.5719 0.8178 7.3157 3.4732 0.9579 4.2929 18.1523 4.0473 0.7000 11.1914 1.7654 7.1250 24.9891 3.8512 11.7834 3.6468 6.7407 5.4883 13.4075 7.6758 23.0361 24.1029 29.6165 3.0930 46.3450 7.7319 15.5142 17.2090 33.0437 3.7695 237.3012 31.0547 130.4913 1.2989 22.5765 6.8983 74.1249 0.2417 4.4060 1.6922 2.1513 0.4451 10.0735 7.3081 9.1563 36.5249 12.2208 48.1464 18.4156 15.6650 2.9516 238.0870 42.2345 118.3657 199.8191 188.2866 17.0823 148.1431 185.6122 9.8354 15.1786 43.6959 60.3104 0.6000 61.8606 71.6026 34.9751 34.3339 47.0537 11.0144 25.6883 20.5295 15.4306 26.0064 17.5561 68.0405 7.0088 10.5222 118.0472 96.6176 23.5160 192.2728 4.3995 1.1482 81.7368 6.9989 5.7164 2.1239 9.0571 3.2101 9.6016 13.8344 10.3838 12.3748 3.5307 17.9831 1.4072
temp: 298.150 k
press: 1.00000 atm
elementType: 8 8 8 8 8 8 8 7 7 7 6 6 6 6 6 6 6 6 6 6 6 6 6 6 6 6 6 1 1 1 1 1 1 1 1 1 1 1 1 1 1 1
symmnumber: 1
zpe: 790212.4 jmol-1
zpe.correction: 0.300976 hartree
zpe.thermalcorrener: 0.326389 hartree
zpe.thermalcorrenthalpy: 0.327333 hartree
zpe.thermalcorrgfe: 0.241931 hartree
zpe.sumelectzpe: -1345.533883 hartree
zpe.sumelectthermal: -1345.508470 hartree
zpe.sumelectthermalent: -1345.507525 hartree
zpe.sumelectthermalfe: -1345.592927 hartree
dipole: -3.0466 -1.9638 -6.5470
dipole: 7.4835
quadrupole: -182.6909 -145.3459 -157.7255
quadrupole: 4.5081 10.7739 -6.0770
quadrupole: -20.7701 16.5748 4.1953 4.5081 10.7739 -6.0770
hfenergy: -1345.8348589 hartree
pointgroup: C01 [X(C17H15N3O7)]
dipole: 1.5435447 -1.5898571 1.9386242 debye
polarizability: 263.5808612|40.3898235|218.6316634|-10.0740341|12.9685715|230.7848236 unknown
InChI: InChI=1S/C17H15N3O7/c1-11(21)18(13-6-4-3-5-7-13)17(27-12(2)22)15-9-8-14(19(23)24)10-16(15)20(25)26/h3-10,17H,1-2H3
charge 0 multiplicity 1
42 atoms
O  1.260742 1.474003 1.675578
O  3.17598 2.021364 -0.818084
O  -1.078565 -0.321365 -3.286463
O  0.366906 1.232657 -2.459346
O  0.558621 3.677094 1.32223
O  -5.199945 -0.996403 1.396659
O  -5.166134 -1.160596 -0.880143
N  1.863346 0.191256 -0.243514
N  -0.608081 0.400122 -2.32524
N  -4.620193 -0.872133 0.251017
C  0.875202 1.137563 0.257872
C  -0.55672 0.610887 0.218247
C  -1.240093 0.262278 -0.984324
C  1.684505 -1.234489 -0.046352
C  -1.274398 0.443507 1.428592
C  3.050558 0.76642 -0.771126
C  -2.559674 -0.228709 -0.989764
C  -2.59721 -0.030114 1.457743
C  -3.223282 -0.362651 0.239362
C  1.680566 -1.7668 1.266633
C  1.495296 -2.086315 -1.161436
C  4.134663 -0.184453 -1.248352
C  1.488009 -3.152843 1.458819
C  1.316676 -3.472987 -0.962103
C  1.15386 2.843165 2.031184
C  1.310032 -4.009227 0.346698
C  1.859756 3.100131 3.340744
H  0.971637 2.071858 -0.326082
H  -0.765779 0.689247 2.362901
H  -3.050364 -0.498772 -1.927918
H  -3.144341 -0.149884 2.396213
H  1.832499 -1.092134 2.115601
H  1.486549 -1.665893 -2.17333
H  4.299697 -1.017528 -0.544785
H  5.062028 0.394011 -1.370661
H  3.866284 -0.622493 -2.226236
H  1.485691 -3.564465 2.474013
H  1.171224 -4.129297 -1.826605
H  1.165662 -5.084203 0.498707
H  1.699066 2.272432 4.050466
H  2.946621 3.172221 3.153072
H  1.512305 4.050431 3.771712
