program: Gaussian 09
title: 000262100
version: EM64L-G09RevD.01
frameworkgroup: C1[X(C7H8N2O4S)]
method: RPBEPBE
basis: SDD
operation: Freq
keyword: #p
keyword: freq=noraman
keyword: PBEPBE/SDD
title: #p freq=noraman PBEPBE/SDD
converged: YES YES NO NO
title: Mulliken charges:
elementType: S O O O O N N C C C C C C C H H H H H H H H
charge: 0.809236 -0.561261 -0.585270 -0.436942 -0.243080 -0.260506 -0.448623 -0.118317 -0.217761 -0.219439 0.265994 -0.333162 -0.305870 0.123304 0.281228 0.291020 0.280033 0.284307 0.294909 0.350193 0.360818 0.389189
chargesum: 0.00000
title: Mulliken charges with hydrogens summed into heavy atoms:
elementType: S O O O O N N C C C C C C C
charge: 0.809236 -0.561261 -0.585270 -0.047753 -0.243080 0.034403 0.262388 -0.118317 0.063467 0.071581 0.265994 -0.053128 -0.021563 0.123304
polarizability: 2.26834848e+02 -1.37229036e+01 1.38076086e+02 1.08976577e+01 3.28680780e+00 8.14214682e+01
1716.lowfreq: -14.0321 -3.9284 -0.0024 0.0013 0.0013 4.6626 21.7312 32.2170 58.2532
frequency: 21.6213 32.0133 58.2323 72.3683 74.3470 90.8047 126.0908 188.6608 194.0336 220.7863 250.9937 312.9804 325.7201 375.7268 389.5703 408.5044 415.5892 466.4790 489.8293 507.4394 596.5169 612.7333 617.4880 671.6552 685.6414 743.7810 754.1221 756.7133 859.8418 870.7353 876.5548 923.8661 991.7854 994.3238 1000.4384 1018.4923 1046.2874 1107.3034 1132.6950 1146.8973 1179.8796 1239.7506 1286.9208 1322.3593 1390.0045 1392.8999 1438.2728 1465.7962 1584.7930 1595.4405 1645.0463 1688.2229 3154.9202 3157.2284 3172.2585 3184.0175 3269.1200 3410.5233 3533.3466 3599.4699
redmass: 6.2698 5.1873 2.8682 6.3911 7.1420 4.8367 9.9914 9.3688 7.3667 5.0864 7.2492 4.5992 6.0795 6.4280 6.8978 2.8455 2.0006 3.5106 5.8821 4.3623 1.2656 4.7435 7.0593 1.3989 3.6603 6.1333 10.1540 3.9244 1.2922 1.7375 6.9072 1.0937 2.1269 2.3410 1.3960 4.4905 2.2847 1.3244 1.1380 1.7307 1.1896 4.3021 1.2819 2.6560 3.1526 10.0757 1.3631 2.3988 8.1091 6.1504 8.8951 1.0863 1.0884 1.0901 1.0970 1.0960 1.0765 1.0498 1.0642 1.0967
irintensity: 3.6064 1.2785 14.0666 4.1814 4.4972 15.6016 8.5010 3.7207 12.0051 39.3299 13.1467 37.6336 14.2872 5.6473 10.0957 0.3387 9.3854 38.2288 14.6288 42.9973 68.4448 46.6777 1.1795 685.0300 72.3808 38.4652 23.4858 10.8454 5.1763 43.3988 58.9501 43.9978 41.8086 67.8587 0.7346 218.2377 5.5761 4.0210 27.4800 99.3332 12.9335 207.7062 4.4310 104.3003 27.3478 12.8227 29.0592 7.8300 13.9952 53.7227 284.1262 30.3089 1.9266 2.6511 0.7581 0.5398 26.7904 95.3670 55.8066 41.0685
temp: 298.150 k
press: 1.00000 atm
elementType: 16 8 8 8 8 7 7 6 6 6 6 6 6 6 1 1 1 1 1 1 1 1
symmnumber: 1
zpe: 395604.7 jmol-1
zpe.correction: 0.150678 hartree
zpe.thermalcorrener: 0.165573 hartree
zpe.thermalcorrenthalpy: 0.166518 hartree
zpe.thermalcorrgfe: 0.106231 hartree
zpe.sumelectzpe: -1078.785435 hartree
zpe.sumelectthermal: -1078.770539 hartree
zpe.sumelectthermalent: -1078.769595 hartree
zpe.sumelectthermalfe: -1078.829882 hartree
dipole: 1.0681 -1.7976 2.8295
dipole: 3.5182
quadrupole: -67.3662 -88.7052 -96.7529
quadrupole: -19.5594 5.4852 3.1510
quadrupole: 16.9085 -4.4304 -12.4781 -19.5594 5.4852 3.1510
hfenergy: -1078.9361127 hartree
pointgroup: C01 [X(C7H8N2O4S1)]
dipole: 0.3782074 0.0448891 -1.3307465 debye
dipolederiv: 1.0612035 -0.1264629 0.1279474 -0.3155662 0.8202872 0.1353355 0.0339633 -0.0691083 0.9082147 -0.6440681 0.0490487 0.0067259 0.0099262 -0.5799006 0.1323826 0.1148474 0.1635522 -0.6857 -0.5801966 0.005179 -0.062713 0.1448056 -0.5555738 -0.1992169 -0.0202777 -0.074209 -0.5027748 -0.9376371 -0.4572271 0.1298053 -0.6315815 -0.8066209 0.0921897 0.1464194 0.083002 -0.4410187 -0.9939622 0.2726718 -0.0804946 0.2293571 -0.8135215 0.1333053 -0.1029518 0.1518102 -0.3679029 0.8527172 0.1792941 -0.5984414 1.0121995 -0.0523376 -0.9377715 -0.4187528 -0.1936276 -0.0024521 -1.2217054 -0.2430701 0.8590843 -0.9378589 -0.1610942 0.7859113 0.459244 0.0943949 -0.2874346 0.2368302 0.0082623 -0.0784675 0.0716472 0.0193437 -0.0407343 0.1640605 0.0059792 -0.1877061 -0.4046743 0.2083825 -0.0074805 -0.0500254 -0.0703133 0.0008494 0.0253172 0.0309919 -0.1066028 -0.4445587 -0.1686252 0.0842807 0.1274824 -0.0368905 -0.030376 -0.0282784 -0.0571321 -0.0829102 -0.7179442 0.0469013 -0.0111487 0.089256 -0.0132377 0.0073723 -0.0601739 0.011879 0.0086566 0.1092124 -0.1656282 0.0452678 0.1889295 0.0159115 -0.0364335 -0.064571 -0.0402512 -0.0763165 0.1379801 0.1604486 -0.0409966 -0.2003542 -0.0021083 -0.0187282 0.0418811 -0.0280931 -0.0826176 2.1818362 0.0370908 0.0178552 0.165596 1.2736729 -0.2806429 0.0668394 -0.2899757 0.3138891 0.1010161 -0.0763047 0.0084692 -0.0436427 0.0688742 0.0253287 0.0306383 0.0135739 0.1358024 0.1448586 0.0583045 -0.0327885 0.0340252 0.0682969 0.0174484 0.0167373 0.0453482 0.1382499 0.0614433 0.0529026 -0.0126815 0.0238651 0.0302124 0.0348039 -0.0135972 0.0375673 0.1475093 0.0460194 -0.0535347 0.0143512 -0.0477672 0.0524537 0.028426 0.0041209 0.0301187 0.1528906 0.0711376 0.0649784 -0.0501266 -0.0196369 0.149426 0.1085293 0.0501349 0.1326091 0.0509126 0.5120886 0.0313538 -0.2456692 -0.1247192 0.126131 0.0441847 -0.1760855 -0.0151741 0.2348447 0.1916401 0.02795 -0.0365796 0.0989886 0.1898144 -0.04227 -0.2135133 -0.0737758 0.3434534 0.2367635 0.0880846 -0.0361993 0.1750737 0.2771747 0.0401061 -0.0560021 0.0405202 0.389013 unknown
polarizability: 225.9101538|1.2948612|126.6487337|-21.7423251|-21.9850784|93.7735142 unknown
InChI: InChI=1S/C7H5O4S.H3N2/c8-7(9)5-1-3-6(4-2-5)12(10)11;1-2/h1-4,8H;1H,2H2
charge 0 multiplicity 1
22 atoms
S  2.456972 -0.54486 0.319759
O  2.678332 -1.792322 1.377579
O  3.05794 0.971707 0.658656
O  -4.377264 -0.914738 0.092423
O  -4.180642 1.315245 -0.526558
N  3.704527 -0.696291 -1.69673
N  4.403902 0.449195 -1.588954
C  0.586093 -0.30436 0.170369
C  0.093003 0.959635 -0.199093
C  -0.237302 -1.410372 0.443976
C  -2.164729 0.016786 -0.055451
C  -1.303108 1.115827 -0.31093
C  -1.633307 -1.241324 0.329537
C  -3.631572 0.237999 -0.193576
H  0.780822 1.796018 -0.355737
H  0.205425 -2.35941 0.762674
H  -1.744128 2.078263 -0.589132
H  -2.314541 -2.070706 0.536273
H  4.26211 -1.47551 -1.272264
H  5.086815 0.638363 -0.841938
H  3.954147 1.269993 -1.998772
H  -5.344391 -0.708138 -0.013312
