program: Gaussian 09
title: 000262092
version: EM64L-G09RevD.01
frameworkgroup: C1[X(C7H9N3O3S)]
method: RPBEPBE
basis: SDD
operation: Freq
keyword: #p
keyword: freq=noraman
keyword: PBEPBE/SDD
title: #p freq=noraman PBEPBE/SDD
converged: NO YES NO NO
title: Mulliken charges:
elementType: S O O O N N N C C C C C C C H H H H H H H H H
charge: 0.916249 -0.555862 -0.538762 -0.257760 -0.288660 -0.345380 -0.076482 -0.775640 0.092656 0.214921 -0.252529 -0.174225 -0.154928 -0.351894 0.288182 0.294561 0.268416 0.286688 0.386042 0.278919 0.250427 0.240751 0.254309
chargesum: 0.00000
title: Mulliken charges with hydrogens summed into heavy atoms:
elementType: S O O O N N N C C C C C C C
charge: 0.916249 -0.555862 -0.538762 -0.257760 -0.000477 0.040662 -0.076482 0.074025 0.092656 0.214921 0.026390 0.076203 0.085823 -0.097585
polarizability: 2.40241686e+02 -6.43787734e-01 1.28517466e+02 1.91625335e+00 -4.37675488e+00 9.86677640e+01
1716.lowfreq: -13.5521 -5.8911 -1.4803 -0.0027 -0.0018 -0.0009 26.9628 38.4234 50.1719
frequency: 26.6615 38.1593 50.0959 87.3750 97.3065 120.4395 156.9693 172.7638 180.9799 230.1630 240.6887 299.4810 319.5297 342.5009 374.2210 400.8726 424.9655 455.7748 485.9538 550.6959 615.4694 673.9253 697.5554 750.9211 774.0221 798.7852 815.3674 843.0058 879.1653 916.9593 952.1182 971.0916 973.2064 974.2652 1008.3773 1013.5380 1025.1219 1053.9985 1087.0697 1152.7079 1164.0078 1264.0369 1286.6114 1296.3598 1336.8789 1366.3912 1416.6737 1418.3843 1419.3276 1448.4576 1455.3456 1565.9229 1580.4342 1606.7165 3024.2529 3143.7784 3154.1371 3172.2597 3175.9393 3179.0535 3182.6856 3183.1646 3461.7978
redmass: 7.6610 5.1336 4.6720 5.6514 6.0969 10.7596 5.5386 1.6377 2.0000 7.2906 4.3688 7.3961 7.0994 5.8849 8.1438 3.3867 4.9478 4.9939 5.6632 8.1460 7.3991 3.9832 6.0503 1.7797 3.8669 1.7474 2.2505 4.3081 4.0972 1.3133 1.2553 3.8307 1.4848 1.4797 1.6811 1.3537 2.8487 2.6450 1.6033 2.6210 1.0877 4.0951 1.5304 1.1442 5.9185 1.7363 1.4275 1.1092 1.1911 2.1817 1.5110 6.0196 5.7630 7.1133 1.0241 1.0883 1.0908 1.0951 1.1070 1.1084 1.0757 1.0976 1.0796
irintensity: 1.7283 3.5426 2.5716 4.8995 1.8420 10.3344 2.0930 3.2013 12.0329 16.1118 2.2732 9.2161 19.0907 17.6605 17.3630 4.6082 6.1908 1.3120 4.3767 25.2995 6.8497 23.1805 4.4202 41.1217 29.1709 72.1465 0.4966 15.5561 35.9164 0.1681 68.3954 2.8806 11.7426 28.0884 89.5621 0.1617 11.4537 19.3932 15.6694 116.4790 1.3522 37.4822 5.2761 12.1868 6.9626 407.8923 4.4489 5.5213 10.1962 19.0036 163.5901 9.1589 8.7240 96.3908 1.2842 6.3797 10.5172 10.7860 1.0078 0.8706 28.7647 10.0289 130.7848
temp: 298.150 k
press: 1.00000 atm
elementType: 16 8 8 8 7 7 7 6 6 6 6 6 6 6 1 1 1 1 1 1 1 1 1
symmnumber: 1
zpe: 426677.4 jmol-1
zpe.correction: 0.162513 hartree
zpe.thermalcorrener: 0.177123 hartree
zpe.thermalcorrenthalpy: 0.178067 hartree
zpe.thermalcorrgfe: 0.119052 hartree
zpe.sumelectzpe: -1058.905893 hartree
zpe.sumelectthermal: -1058.891284 hartree
zpe.sumelectthermalent: -1058.890339 hartree
zpe.sumelectthermalfe: -1058.949354 hartree
dipole: 5.5356 3.3341 0.1093
dipole: 6.4630
quadrupole: -72.6394 -89.8180 -92.2622
quadrupole: -17.1919 -5.2898 -4.0601
quadrupole: 12.2671 -4.9115 -7.3557 -17.1919 -5.2898 -4.0601
hfenergy: -1059.0684062 hartree
pointgroup: C01 [X(C7H9N3O3S1)]
dipole: -2.1403761 -1.3662042 0.1335499 debye
dipolederiv: 0.9964252 0.0224591 0.0858222 0.0431959 1.0257738 -0.0421981 -0.5100812 -0.0935341 0.9987253 -0.3793913 0.0363685 -0.1380476 -0.0058578 -0.4378279 -0.0335624 0.1294949 0.0190216 -0.6357741 -0.8408315 -0.1540379 0.0672447 -0.1470297 -0.5565222 0.0296659 0.280729 0.0686449 -0.501615 -0.4982775 0.2036536 -0.1789022 -0.4652806 -0.8026613 0.2808121 -0.0776008 0.1187922 -0.4000449 0.847451 -0.0390839 -0.6300495 -0.181472 -0.0652634 0.0653898 0.0326821 -0.0274921 -0.3929606 -1.5629738 -0.0963705 0.5482411 -0.629858 -0.4394414 0.067311 -0.5393258 -0.1240699 0.0267723 -0.429567 0.0211901 -0.0316687 -0.0627937 -0.3202352 -0.0717134 -0.0848779 -0.0158576 -0.19635 -0.1201631 0.0279751 0.0326281 0.0122884 -0.201682 0.0172336 0.2384969 -0.0118848 -0.1197232 0.0186619 -0.0000989 -0.056153 0.1675913 0.0433848 0.0922163 0.0220555 0.0136031 0.0075086 1.3592631 -0.0310407 0.2003036 1.1247164 1.02843 -0.3975374 0.496959 0.0057076 0.3565116 -0.2482979 -0.0726465 -0.0408389 -0.0442256 0.0142966 -0.0365883 -0.108113 -0.0211321 -0.0911886 0.1365605 0.1001785 0.1122827 0.098501 0.1126797 0.0556258 0.1261678 0.0700953 -0.0483448 0.0132527 -0.1046396 0.0773446 0.1195304 -0.1964771 0.0135247 0.0641051 -0.0618047 -0.049133 -0.0626804 0.0200375 0.0268477 -0.3113969 0.3827029 -0.0432478 -0.0513376 0.0382163 -0.0466672 0.1281127 -0.0330874 0.0797397 0.151504 -0.0140789 0.0063884 0.0992864 0.0047518 0.2105536 0.0426093 0.0312603 0.0536047 0.1233394 0.059326 -0.0360448 0.0378566 -0.006456 0.0040159 0.0205592 0.0329549 -0.072613 0.0451183 0.0421413 -0.0134375 -0.0676299 -0.0041152 0.0302957 0.000553 -0.0346109 0.0309751 -0.004177 0.0213576 0.0017093 0.0212251 0.0145381 0.0961512 0.4003537 -0.0047092 0.0255608 -0.1285362 0.2515723 0.0627799 0.0833381 0.0232301 0.2467588 0.1426337 0.0552519 -0.0223795 0.0472307 0.0158604 0.0000879 -0.002393 0.0126709 0.1459558 0.0230225 -0.0703293 -0.0557492 -0.0867429 0.0101801 -0.049053 -0.0682843 -0.0468033 0.1168361 -0.0440749 0.0470759 -0.0872155 0.0394491 0.0921061 0.0146515 -0.0915397 0.0180567 0.1172117 0.0567987 0.0422495 -0.0269779 0.0949055 -0.0656222 0.0159866 -0.0312132 0.0058212 0.1245048 unknown
polarizability: 239.9488884|3.0770157|129.2155229|5.8221745|-0.3519493|98.2625051 unknown
InChI: InChI=1S/C6H6N3O.CH3O2S/c7-9-6(10)5-3-1-2-4-8-5;1-4(2)3/h1-4,7,9H;1H3
charge 0 multiplicity 1
23 atoms
S  3.154411 0.558471 -0.092286
O  1.86966 0.5272 -1.125603
O  4.358601 1.641795 -0.302515
O  0.508806 -1.510671 1.180338
N  1.966028 0.795495 1.86952
N  0.697173 0.804128 1.381638
N  -1.695133 1.223605 0.286734
C  3.949661 -1.191709 -0.194455
C  -1.324566 -0.094771 0.363048
C  0.006858 -0.364452 0.981419
C  -2.120275 -1.157268 -0.119944
C  -3.361297 -0.842741 -0.715388
C  -3.75559 0.512299 -0.801484
C  -2.892479 1.511108 -0.286437
H  2.138056 -0.196887 2.183315
H  4.352461 -1.274172 -1.213784
H  4.742354 -1.226551 0.566005
H  3.132511 -1.900996 -0.001786
H  0.273981 1.705204 1.120568
H  -1.755218 -2.183752 -0.02591
H  -4.006512 -1.635787 -1.106226
H  -4.708061 0.797022 -1.258348
H  -3.162631 2.571028 -0.33752
