program: Gaussian 09
title: 000262113
version: EM64L-G09RevD.01
frameworkgroup: C1[X(C12H21ClN2O3)]
method: RPBEPBE
basis: SDD
operation: Freq
keyword: #p
keyword: freq=noraman
keyword: PBEPBE/SDD
title: #p freq=noraman PBEPBE/SDD
converged: YES YES NO NO
title: Mulliken charges:
elementType: Cl O O O N N C C C C C C C C C C C C H H H H H H H H H H H H H H H H H H H H H
charge: -0.090209 -0.318593 -0.233593 -0.331270 -0.493070 -0.415469 0.276939 -0.466014 -0.467266 -0.390758 -0.392664 -0.394749 0.182459 0.306862 -0.253050 -0.330885 -0.659858 -0.550770 0.201481 0.267048 0.267612 0.203086 0.230164 0.191804 0.190741 0.234598 0.198875 0.197150 0.332107 0.294304 0.224184 0.240899 0.239172 0.268035 0.250583 0.225882 0.221458 0.278437 0.264337
chargesum: 0.00000
title: Mulliken charges with hydrogens summed into heavy atoms:
elementType: Cl O O O N N C C C C C C C C C C C C
charge: -0.090209 -0.318593 -0.233593 -0.331270 -0.160963 -0.121165 0.276939 0.002515 0.003432 0.031210 0.032676 0.001275 0.182459 0.306862 0.212034 0.176323 0.038065 -0.007996
polarizability: 1.84789531e+02 9.25844673e+00 1.76729609e+02 -2.52263241e+00 1.63224062e+00 1.22638313e+02
1716.lowfreq: -8.2855 -0.0016 -0.0013 0.0009 2.7546 5.8677 16.5049 21.6187 39.4672
frequency: 15.7401 21.4891 39.4599 48.3014 70.2594 76.4070 88.2182 93.6029 118.7229 133.6872 185.9432 189.9178 210.0307 253.2401 256.8845 268.6032 279.3086 310.3253 351.0455 356.1690 363.1155 368.3898 402.8951 433.8739 450.1684 468.2081 492.3641 542.9731 584.2413 600.6668 665.2425 706.3858 712.5753 716.7128 733.6947 781.3377 785.9458 817.9346 835.6384 845.3913 859.6495 906.9303 917.8384 940.6627 955.6078 979.5644 988.6912 1012.3676 1039.7814 1048.6936 1060.5605 1088.3340 1096.7665 1104.5460 1110.2359 1141.3008 1151.1521 1153.4657 1175.1631 1193.0523 1194.1029 1228.1734 1246.4007 1260.4844 1275.6191 1277.5607 1291.5042 1301.9164 1323.5746 1341.9372 1349.4929 1350.4562 1354.4687 1364.5666 1368.8874 1391.7860 1438.5889 1442.9339 1456.9023 1460.9210 1462.0015 1463.5285 1466.0848 1466.8524 1476.5244 1481.0128 1483.2139 1501.2046 1618.9524 1640.8126 2970.4397 2983.5883 2986.2732 2986.6739 2993.5599 2994.7052 2996.7955 3031.7632 3033.4033 3041.3040 3044.5763 3048.4560 3060.6113 3062.8875 3066.6375 3089.7953 3095.0089 3120.7578 3152.5869 3517.8314 3549.8135
redmass: 5.9136 4.6796 7.2791 3.0308 5.8107 3.4430 4.2197 4.2836 2.8136 4.5708 2.3563 3.4592 1.6833 4.8062 2.6810 2.3211 2.7561 3.1752 4.1126 2.1310 2.4985 3.0224 1.5640 3.4834 3.3763 2.5351 2.2003 2.3067 2.8075 1.4049 4.0307 4.2983 7.8372 7.1666 3.3074 1.8235 1.6252 1.5531 2.8429 1.9293 2.0674 2.3664 2.0833 1.4008 2.5598 2.2716 2.5738 2.8294 2.0287 1.8714 1.8559 2.9799 2.6643 3.5822 2.0127 1.3753 1.6003 1.5822 2.4128 1.6348 2.1289 1.3355 1.5840 1.3754 1.2191 1.1239 1.3549 1.4005 1.2719 1.4101 1.3252 1.3783 1.3615 1.3483 1.3460 1.2321 1.1097 1.1346 1.0977 1.1112 1.0542 1.1114 1.0798 1.3217 1.1368 1.1005 1.0518 2.2883 4.7367 8.8005 1.0614 1.0604 1.0616 1.0595 1.0615 1.0363 1.0635 1.0975 1.0595 1.1018 1.0985 1.1025 1.1016 1.0601 1.1010 1.0977 1.1032 1.1064 1.1119 1.0771 1.0771
irintensity: 1.2573 0.7502 0.5559 0.9721 3.7362 0.8020 1.7408 9.4339 1.0114 9.7760 0.8016 1.6906 3.9314 2.9835 5.6168 1.1357 0.5950 8.5572 4.2159 4.2480 17.6186 27.2490 9.5935 2.9262 0.3668 9.7453 4.8155 1.3561 42.1688 175.3311 13.1436 7.5453 31.0888 0.3502 11.7087 1.6453 1.2145 0.9731 3.2415 12.0823 11.9769 8.6556 41.2584 3.1616 29.7627 35.4897 1.8243 83.7670 8.5871 2.7692 2.0452 195.9717 10.4407 94.9406 0.5255 1.5917 16.6178 21.0007 41.7484 1.0744 23.2541 11.2140 279.3347 7.6565 0.1049 1.8929 0.5654 80.9196 0.1810 1.1182 8.9685 0.0525 9.1122 14.2149 9.2329 26.4583 11.6692 37.7511 19.0920 13.7302 14.3752 12.7124 13.5456 46.9782 45.5260 10.8449 8.3438 775.9267 115.6507 90.0649 25.9272 8.1952 43.7596 53.8073 89.5048 24.3225 15.8476 58.1287 26.5936 25.9586 7.6039 24.5834 2.2432 24.5270 41.8975 32.6243 2.5429 27.3008 17.6016 93.4314 26.8217
temp: 298.150 k
press: 1.00000 atm
elementType: 17 8 8 8 7 7 6 6 6 6 6 6 6 6 6 6 6 6 1 1 1 1 1 1 1 1 1 1 1 1 1 1 1 1 1 1 1 1 1
symmnumber: 1
zpe: 856570.5 jmol-1
zpe.correction: 0.326250 hartree
zpe.thermalcorrener: 0.346100 hartree
zpe.thermalcorrenthalpy: 0.347044 hartree
zpe.thermalcorrgfe: 0.275032 hartree
zpe.sumelectzpe: -1263.717226 hartree
zpe.sumelectthermal: -1263.697377 hartree
zpe.sumelectthermalent: -1263.696433 hartree
zpe.sumelectthermalfe: -1263.768445 hartree
dipole: 0.0188 2.8082 -0.4373
dipole: 2.8421
quadrupole: -122.2991 -108.1745 -114.8711
quadrupole: -10.2406 -0.6830 -2.3906
quadrupole: -7.1842 6.9404 0.2438 -10.2406 -0.6830 -2.3906
hfenergy: -1264.0434768 hartree
pointgroup: C01 [X(C12H21Cl1N2O3)]
dipole: 0.0181003 1.0986068 -0.2074867 debye
polarizability: 184.6774217|9.2040739|176.9055149|2.6546937|0.6428501|122.5745158 unknown
InChI: InChI=1S/C12H21ClN2O3/c1-2-18-10(16)12(6-4-3-5-7-12)15-11(17)14-9-8-13/h14-15H,2-9H2,1H3
charge 0 multiplicity 1
39 atoms
Cl 5.577957 1.294575 1.183241
O  -1.016201 2.202974 0.273582
O  -2.976818 0.974567 0.506119
O  1.608202 -1.886908 -0.119265
N  0.570909 0.221549 0.089494
N  2.894421 0.066383 -0.137449
C  -0.835405 -0.243777 0.19044
C  -1.249464 -1.00944 -1.118473
C  -1.013045 -1.173035 1.443327
C  -2.611842 -1.732246 -1.023131
C  -2.37351 -1.904458 1.506221
C  -2.657665 -2.679292 0.198524
C  -1.736946 0.996743 0.343029
C  1.669189 -0.613431 -0.057032
C  -1.808821 3.470093 0.371387
C  4.152058 -0.664871 -0.262541
C  -2.297082 3.905442 -1.011951
C  5.054864 -0.525621 0.962939
H  -1.233238 -0.301704 -1.97011
H  -0.449764 -1.753673 -1.288355
H  -0.199891 -1.918339 1.37243
H  -0.84193 -0.576703 2.360333
H  -3.433053 -0.995315 -0.945879
H  -2.771849 -2.305209 -1.957504
H  -2.356258 -2.60183 2.366692
H  -3.188817 -1.180059 1.68678
H  -3.647285 -3.17168 0.258816
H  -1.90041 -3.480053 0.071275
H  0.693716 1.236795 0.094221
H  2.945237 1.079473 -0.017687
H  -1.098274 4.188784 0.810272
H  -2.652138 3.294681 1.06138
H  4.704245 -0.348957 -1.168481
H  3.878871 -1.731797 -0.380405
H  -3.009916 3.171939 -1.424223
H  -1.45268 4.018717 -1.713467
H  -2.813664 4.87996 -0.933311
H  4.539988 -0.789985 1.897582
H  5.999309 -1.079093 0.851481
