program: Gaussian 09
title: 000262112
version: EM64L-G09RevD.01
frameworkgroup: C1[X(C6H9ClN4O3)]
method: RPBEPBE
basis: SDD
operation: Freq
keyword: #p
keyword: freq=noraman
keyword: PBEPBE/SDD
title: #p freq=noraman PBEPBE/SDD
converged: YES YES NO NO
title: Mulliken charges:
elementType: Cl O O O N N N N C C C C C C H H H H H H H H H
charge: -0.065177 -0.234073 -0.288833 -0.224997 -0.271515 -0.195847 -0.383638 0.114770 -0.350863 -0.403414 0.328510 0.325959 -0.339997 -0.549021 0.272916 0.272207 0.278844 0.278077 0.374956 0.250402 0.252622 0.291168 0.266945
chargesum: 0.00000
title: Mulliken charges with hydrogens summed into heavy atoms:
elementType: Cl O O O N N N N C C C C C C
charge: -0.065177 -0.234073 -0.288833 -0.224997 -0.271515 -0.195847 -0.008682 0.114770 0.194259 0.153507 0.328510 0.325959 0.163027 0.009092
polarizability: 1.55958858e+02 -1.24040849e+01 1.18594979e+02 -1.02360692e+01 -5.89463880e+00 7.15684537e+01
1716.lowfreq: -6.4818 -0.0033 -0.0020 -0.0018 5.0061 6.8620 17.8163 27.1755 42.1781
frequency: 17.2819 27.1252 42.1366 63.2610 95.4518 114.8406 143.3783 189.3659 208.2988 225.8548 252.1815 317.4290 339.7739 351.0664 383.2723 418.7697 492.0675 601.9559 612.0442 686.1729 692.6609 709.6112 724.4815 739.4888 785.1355 835.9467 841.9124 901.7913 961.8140 992.9061 1025.1773 1075.6593 1086.3488 1095.6835 1147.4419 1167.5561 1193.9940 1195.8569 1210.5691 1247.8024 1253.2004 1262.5429 1313.8341 1326.0719 1352.7616 1368.1472 1383.1573 1437.2809 1445.4765 1483.0324 1497.1693 1529.0264 1627.0228 1682.0863 3008.0978 3027.9098 3041.7331 3062.1326 3079.2094 3084.8985 3104.5783 3150.8132 3403.3210
redmass: 6.5860 6.3017 2.6446 8.5977 5.6776 3.9693 5.5337 6.8263 7.2483 5.6643 6.2406 6.7942 2.8092 6.2685 9.5690 5.6049 2.9802 4.7061 8.3143 4.6517 6.9081 2.9493 6.7981 1.7736 5.4947 1.1715 2.3298 3.8134 2.5011 2.7241 1.8827 5.1256 3.8193 1.6678 4.2187 1.6688 1.1339 2.5248 1.0740 4.2138 1.3054 3.0881 1.1426 2.3210 2.2318 1.3317 2.8364 1.1045 1.0931 1.0844 1.0948 1.7657 10.2275 7.7002 1.0622 1.0586 1.0602 1.0587 1.1073 1.0998 1.1071 1.1109 1.0815
irintensity: 0.4011 0.4542 1.0009 1.7922 14.6708 1.4200 14.2891 3.5761 1.8946 5.8057 7.6584 10.1984 12.0635 2.3837 0.8792 10.4673 7.8210 19.8716 23.5784 8.9045 9.0056 14.7402 36.1453 139.1963 38.5383 0.5577 5.2029 32.0212 17.8131 30.3340 6.1333 385.9004 243.2719 1.0947 24.2148 3.2988 1.6922 68.7255 0.2846 50.0544 34.8086 310.1812 34.4647 135.3298 84.4519 17.4836 21.1702 19.7038 16.3106 21.4311 33.1496 459.1164 45.4856 419.3096 21.9289 5.4403 14.3693 18.2907 1.0996 7.0484 14.0213 13.5821 123.8704
temp: 298.150 k
press: 1.00000 atm
elementType: 17 8 8 8 7 7 7 7 6 6 6 6 6 6 1 1 1 1 1 1 1 1 1
symmnumber: 1
zpe: 437456.8 jmol-1
zpe.correction: 0.166619 hartree
zpe.thermalcorrener: 0.180644 hartree
zpe.thermalcorrenthalpy: 0.181588 hartree
zpe.thermalcorrgfe: 0.122221 hartree
zpe.sumelectzpe: -1137.678644 hartree
zpe.sumelectthermal: -1137.664619 hartree
zpe.sumelectthermalent: -1137.663675 hartree
zpe.sumelectthermalfe: -1137.723041 hartree
dipole: -0.7784 4.4055 0.0230
dipole: 4.4738
quadrupole: -92.8792 -100.3157 -84.9070
quadrupole: 10.0848 -8.1083 0.3003
quadrupole: -0.1786 -7.6151 7.7936 10.0848 -8.1083 0.3003
hfenergy: -1137.8452626 hartree
pointgroup: C01 [X(C6H9Cl1N4O3)]
dipole: 0.5028998 1.6847536 -0.0820104 debye
dipolederiv: -0.2103413 -0.0123011 -0.0042117 0.0704465 -0.4519747 0.1880271 -0.0638849 0.1255442 -0.2857031 -0.7579731 0.1871735 0.1142987 0.1442355 -0.8976407 -0.2287794 0.1040848 -0.2251312 -0.405825 -0.8035415 -0.2074424 -0.0283149 -0.1080248 -0.9651437 -0.1296057 0.0139462 -0.1388599 -0.3973647 -1.2791725 -0.4419492 0.0057871 0.3805612 -0.1174796 -0.0361168 0.2869254 0.0840154 -0.1842078 -1.7738065 -0.4173422 0.0261271 -0.6344619 -0.8671563 -0.1405777 0.0317185 -0.1435311 -0.257066 -1.7453222 -0.1878597 0.1537136 -0.5797599 -0.4013339 -0.0100023 0.064117 -0.0566009 -0.1565984 -1.1748338 0.2584814 0.0240471 0.3799242 -0.6491686 -0.1002094 0.2170725 -0.1332675 -0.5468184 1.7870576 0.6908467 -0.0269903 0.5993859 0.2645409 0.0126231 -0.0834972 -0.013537 -0.0182761 0.2064714 -0.1600039 -0.037567 -0.1420122 0.3479561 0.0312909 -0.0337738 0.0464626 0.3082389 0.126259 -0.0287698 0.0167805 -0.2127393 0.1148052 -0.0268824 -0.0382268 -0.0494715 0.2728954 1.9980576 0.094888 -0.1849936 0.1910578 1.3629563 0.3511931 -0.194913 0.321322 0.4469467 2.2479634 0.2263973 -0.1068543 -0.148811 1.3371584 0.2759758 -0.3181357 0.276489 0.3819358 0.7717895 -0.1986137 0.0100583 0.0637398 0.0215887 0.0378443 -0.0737443 0.0477055 0.2040552 0.0805337 0.044621 0.0028782 -0.0752153 0.6163481 -0.2236779 0.0176396 -0.2492637 0.2195541 0.073134 0.0005639 0.0169626 0.0203591 -0.0339184 0.0444735 0.0099041 0.0767869 0.0206781 0.0562504 -0.0042413 -0.0421033 0.0156555 0.0435185 -0.0313973 -0.0244176 -0.0631392 -0.0511791 0.0311135 -0.0001477 0.0549194 -0.0282299 0.0608506 0.0198463 0.0531435 -0.0183379 -0.0340261 -0.0031896 0.0448864 -0.0506204 0.0123159 0.0319425 0.0189349 -0.0676713 0.0488659 0.0240177 0.3991208 0.0130829 0.0118669 0.094411 0.218397 -0.0261525 0.0554862 -0.0109303 0.3319742 -0.0166492 0.0338131 0.0019463 0.0563028 0.0439628 -0.1306019 0.0369151 -0.0767041 -0.0000783 0.0154694 0.0532711 -0.034851 -0.1030549 -0.0116159 0.0885678 -0.0306656 0.0763908 0.0615874 0.118488 0.0303354 0.0588528 0.0174358 -0.0641507 -0.0321467 0.033928 0.0007996 -0.0148024 -0.1468788 -0.0196897 0.0182677 -0.0135218 -0.0044427 0.0473734 0.0040491 0.0743927 0.0800619 unknown
polarizability: 158.9641112|7.1731809|116.9466232|-6.0277521|4.7648623|70.2115566 unknown
InChI: InChI=1S/C6H9ClN4O3/c7-1-2-8-5(12)10-3-4-11(9-14)6(10)13/h8H,1-4H2
charge 0 multiplicity 1
23 atoms
Cl 3.889002 -2.007981 1.104373
O  -0.513611 -1.592994 -0.741544
O  1.590228 2.052508 0.086944
O  -4.503959 -0.762253 0.131812
N  -0.292281 0.679776 -0.050563
N  -2.354876 -0.223959 -0.022078
N  1.846736 -0.157347 -0.657231
N  -3.344673 -1.200848 -0.183009
C  -1.15873 1.779958 0.446507
C  -2.58741 1.16115 0.452406
C  -0.98435 -0.508365 -0.323368
C  1.119052 0.911958 -0.198007
C  3.298387 -0.03681 -0.824802
C  4.089354 -0.237503 0.472519
H  -1.077254 2.651875 -0.221542
H  -0.829015 2.090897 1.450749
H  -3.048072 1.140245 1.454392
H  -3.286897 1.675845 -0.227886
H  1.367858 -1.056983 -0.808496
H  3.624234 -0.766437 -1.585262
H  3.525161 0.981125 -1.195844
H  3.727643 0.415313 1.279387
H  5.168973 -0.099272 0.310042
