program: Gaussian 09
title: 000262141
version: EM64L-G09RevD.01
frameworkgroup: C1[X(C23H29NO)]
method: RPBEPBE
basis: SDD
operation: Freq
keyword: #p
keyword: freq=noraman
keyword: PBEPBE/SDD
title: #p freq=noraman PBEPBE/SDD
converged: YES YES NO NO
title: Mulliken charges:
elementType: O N C C C C C C C C C C C C C C C C C C C C C C C H H H H H H H H H H H H H H H H H H H H H H H H H H H H H
charge: -0.456018 -0.080315 -0.044031 -0.105794 -0.482774 -0.461305 -0.428761 -0.462483 -0.418940 -0.366966 -0.365137 -0.437225 -0.227420 0.504245 -0.460241 -0.388123 -0.406656 -0.397687 0.351268 0.339286 -0.397714 -0.397680 -0.236270 -0.236444 -0.242949 0.199958 0.209786 0.207498 0.208202 0.219567 0.208088 0.204484 0.197786 0.193745 0.200620 0.173714 0.207007 0.207420 0.192855 0.217030 0.193144 0.197913 0.224311 0.192395 0.333048 0.228872 0.260505 0.237533 0.235213 0.237545 0.239779 0.224282 0.225008 0.228831
chargesum: 0.00000
title: Mulliken charges with hydrogens summed into heavy atoms:
elementType: O N C C C C C C C C C C C C C C C C C C C C C C C
charge: -0.122970 -0.080315 0.155926 0.103991 -0.067074 -0.033651 -0.026491 -0.068118 -0.038220 0.033309 0.045037 -0.015002 -0.035025 0.504245 -0.231369 -0.127618 -0.169124 -0.162474 0.351268 0.339286 -0.160169 -0.157902 -0.011988 -0.011436 -0.014118
polarizability: 3.42482906e+02 -5.35615199e+01 2.24934559e+02 1.96679163e+01 1.86764868e+01 2.13823165e+02
1716.lowfreq: -14.1683 -4.7340 0.0002 0.0003 0.0006 4.5347 15.3968 17.2860 29.4867
frequency: 5.7475 16.7310 29.1406 37.6342 55.3124 73.2394 77.9592 84.7912 95.2743 149.3452 156.3475 175.2944 198.0558 224.3457 246.6872 274.9250 302.0094 307.3461 322.6656 330.3397 361.7840 368.1993 384.4806 395.6100 404.6282 410.7894 431.8558 453.9351 479.8079 502.6683 527.0681 563.3247 581.5430 599.2951 614.0324 637.7421 664.9687 695.9042 702.4024 720.8964 739.6057 762.8607 765.2500 770.8516 777.5596 800.2095 809.6911 828.7452 846.5405 850.9083 852.3478 862.9132 889.6736 919.6647 929.9352 940.4368 957.8485 962.5028 973.8507 975.4922 977.8102 988.0842 993.5020 994.8256 996.1036 997.4844 1005.7060 1018.6203 1034.6712 1040.3059 1043.9250 1065.0444 1078.8829 1083.5329 1084.6094 1103.4291 1119.9492 1128.6964 1130.0833 1161.7266 1167.2575 1172.8644 1177.4479 1189.3738 1199.9245 1201.5599 1205.2421 1218.6834 1222.0136 1228.9244 1244.2144 1265.3230 1272.6232 1288.6094 1289.5281 1298.3812 1300.7010 1303.5780 1311.9765 1316.4093 1316.9477 1322.7602 1325.9277 1336.7393 1353.9536 1358.3570 1363.8411 1372.2222 1373.8273 1393.8141 1400.6196 1412.1865 1438.4850 1450.5129 1453.6950 1456.4510 1462.4927 1463.1193 1473.8689 1477.1763 1483.3232 1484.9780 1517.9929 1569.8876 1588.8266 1612.5210 1623.3278 2819.9227 2867.5283 2881.3177 2934.7495 2960.7808 2972.8965 2973.7776 2978.9693 2992.2240 2994.2693 3003.2000 3010.9955 3014.7783 3019.1716 3028.4849 3040.2416 3044.8997 3047.6132 3071.2500 3114.3120 3121.2040 3125.5527 3131.0643 3139.1654 3143.6661 3147.8145 3160.7395 3164.0912 3553.3512
redmass: 3.7388 4.5957 3.7417 3.9842 3.9913 2.5187 3.7963 3.3047 4.7742 3.6291 2.2679 2.9099 5.3402 3.3602 4.1284 3.2045 2.5537 1.3433 2.8134 2.9339 3.3007 2.0247 3.5017 3.3618 2.8518 2.8824 1.9720 3.8339 2.7574 3.8475 3.5966 2.6152 2.4363 4.4199 6.2676 6.8764 2.4919 3.6690 1.7549 3.9829 2.8832 1.8667 1.9846 1.9487 2.7235 3.6653 2.2294 1.8135 1.4110 1.2534 1.4252 2.4524 1.9755 1.4499 1.8648 2.3113 1.7722 1.9224 1.4298 1.4945 2.8207 4.7407 1.3344 2.4815 3.2186 3.4533 1.9629 2.5708 2.0078 1.8978 2.2209 2.5039 2.4960 1.6352 1.8157 1.7645 1.5034 1.5714 1.6071 1.4002 1.4031 1.0527 1.2531 1.1132 1.1278 1.2036 1.5617 1.4833 1.5058 1.4548 1.4039 1.2547 1.2572 1.3123 2.9197 1.3901 1.2510 1.4163 1.5096 1.4471 1.4205 1.3397 1.3219 1.5104 1.4713 2.1270 1.4423 1.3381 7.1985 1.6488 1.5588 3.0104 2.3617 1.0820 1.0929 1.0814 1.0923 1.0850 1.1102 2.1325 1.0877 1.0964 2.9467 5.9101 6.6072 6.0408 6.3921 1.0705 1.0704 1.0689 1.0842 1.0624 1.0619 1.0692 1.0668 1.0680 1.0758 1.0882 1.0815 1.0852 1.0911 1.0946 1.1021 1.1011 1.1000 1.1032 1.0876 1.0844 1.0875 1.0880 1.0923 1.0948 1.0962 1.0957 1.1015 1.0658
irintensity: 0.0426 0.0446 0.0533 0.0696 1.1245 0.0141 0.1201 0.4474 0.5378 0.7713 1.4608 0.5960 4.5321 5.8422 0.0871 11.8913 10.6864 109.1767 0.9520 15.5408 0.7599 4.0989 2.4933 7.3771 0.0184 1.8966 1.4921 2.4489 4.0858 2.6972 12.6537 1.3043 10.4351 8.9730 0.5942 1.3268 4.8143 9.7503 46.1558 2.2593 23.1572 2.6106 2.5200 56.9791 9.0261 1.6734 7.4268 19.1066 21.6347 0.7370 22.3968 8.4978 4.8518 2.8522 15.2130 12.8985 20.7154 13.9146 0.1977 7.0576 35.3588 1.1895 0.0557 8.1396 1.1360 15.2406 2.1705 2.2845 0.5938 3.6416 3.7489 15.2586 18.4573 11.3949 14.8925 20.8855 16.0327 13.9282 10.1448 58.3779 0.7875 0.0161 7.6318 2.5986 4.5513 4.2512 2.2956 6.2835 6.6258 9.1433 1.4325 1.3604 7.9256 0.7814 0.3074 5.6476 6.9489 1.1169 2.2569 3.6279 7.2944 4.8285 2.2834 9.0395 12.9257 14.7165 4.7594 6.3333 0.3651 7.2039 7.9115 8.1590 3.0602 0.5731 5.5697 2.9381 12.5455 10.5415 34.7279 33.2398 4.0852 9.3990 4.1730 2.7919 0.6529 10.7685 1.3917 89.3016 38.5690 128.1491 46.0582 28.3289 44.2563 3.3241 8.0774 91.2083 95.2684 7.5707 84.1110 87.7096 19.4465 47.3764 39.8139 3.8485 62.1853 87.3117 23.3549 5.8971 3.4824 10.4188 14.2566 8.8542 47.3259 6.6523 26.5054 7.2074
temp: 298.150 k
press: 1.00000 atm
elementType: 8 7 6 6 6 6 6 6 6 6 6 6 6 6 6 6 6 6 6 6 6 6 6 6 6 1 1 1 1 1 1 1 1 1 1 1 1 1 1 1 1 1 1 1 1 1 1 1 1 1 1 1 1 1
symmnumber: 1
zpe: 1221079.4 jmol-1
zpe.correction: 0.465085 hartree
zpe.thermalcorrener: 0.487687 hartree
zpe.thermalcorrenthalpy: 0.488631 hartree
zpe.thermalcorrgfe: 0.409554 hartree
zpe.sumelectzpe: -1021.943830 hartree
zpe.sumelectthermal: -1021.921228 hartree
zpe.sumelectthermalent: -1021.920283 hartree
zpe.sumelectthermalfe: -1021.999360 hartree
dipole: -1.4648 -1.2144 -0.7948
dipole: 2.0621
quadrupole: -144.9086 -151.4655 -143.4847
quadrupole: -9.4291 4.2436 2.3760
quadrupole: 1.7110 -4.8459 3.1349 -9.4291 4.2436 2.3760
hfenergy: -1022.4089144 hartree
pointgroup: C01 [X(C23H29N1O1)]
dipole: 0.5673138 -0.5077176 0.2802761 debye
polarizability: 341.4733946|51.4423196|228.0338605|28.1001016|-16.0155061|211.7333747 unknown
InChI: InChI=1S/C23H29NO/c25-23(13-15-24-14-12-18-6-7-19(16-18)17-24)22-10-8-21(9-11-22)20-4-2-1-3-5-20/h1-5,8-11,18-19,23,25H,6-7,12-17H2
charge 0 multiplicity 1
54 atoms
O  0.293837 3.834255 -0.039457
N  3.175335 -0.206273 0.431692
C  5.45413 -1.166724 -1.33833
C  5.339101 -1.390499 1.110302
C  5.513543 -2.218693 -0.192024
C  6.08541 0.126204 -0.706487
C  6.207695 -0.132564 0.827411
C  4.010066 -0.938349 -1.871767
C  3.870881 -1.031371 1.452474
C  2.886232 -0.979353 -0.808264
C  1.977614 0.49541 0.964987
C  1.655357 1.769119 0.155192
C  0.421253 2.548884 0.683061
C  -0.888773 1.804007 0.476839
C  -1.492365 1.078105 1.531194
C  -1.515318 1.796972 -0.79393
C  -2.684165 0.353019 1.321277
C  -2.706474 1.075429 -1.003298
C  -3.315566 0.334164 0.047819
C  -4.579399 -0.425355 -0.176678
C  -4.837127 -1.642678 0.513357
C  -5.563681 0.046622 -1.089393
C  -6.03307 -2.360825 0.299889
C  -6.759002 -0.671227 -1.306021
C  -7.001186 -1.879715 -0.612144
H  6.069869 -1.501248 -2.19594
H  5.726469 -1.955029 1.982851
H  4.763036 -3.024699 -0.301118
H  6.510441 -2.701268 -0.178328
H  5.430167 0.99343 -0.896956
H  7.072819 0.345725 -1.154752
H  7.259455 -0.340012 1.103842
H  5.871473 0.737193 1.420529
H  3.769749 -1.712575 -2.630444
H  3.981023 0.038989 -2.393069
H  3.309181 -1.984204 1.648625
H  3.879828 -0.458759 2.400284
H  1.962285 -0.582322 -1.269047
H  2.663674 -2.04239 -0.542132
H  1.078409 -0.167843 0.994087
H  2.191286 0.787609 2.012174
H  2.54868 2.426601 0.195686
H  1.480367 1.521435 -0.909019
H  0.564043 2.744419 1.769635
H  1.177349 4.283649 -0.035601
H  -1.0404 1.094993 2.530977
H  -1.070669 2.380791 -1.606092
H  -3.149913 -0.171619 2.163253
H  -3.158803 1.065077 -2.001584
H  -4.08194 -2.044614 1.198606
H  -5.405176 0.998199 -1.609372
H  -6.205465 -3.300401 0.83714
H  -7.505929 -0.28275 -2.007625
H  -7.929436 -2.437342 -0.779013
