program: Gaussian 09
title: 000262097
version: EM64L-G09RevD.01
frameworkgroup: C1[X(C15H14O3)]
method: RPBEPBE
basis: SDD
operation: Freq
keyword: #pfreq=noraman
keyword: PBEPBE/SDD
title: #p freq=noraman PBEPBE/SDD
converged: YES YES NO NO
title: Mulliken charges:
elementType: O O O C C C C C C C C C C C C C C C H H H H H H H H H H H H H H
charge: -0.245581 -0.173191 -0.135216 0.216084 -0.085865 0.056265 0.112495 -0.738851 -0.738723 -0.710238 0.366628 -0.165603 0.306103 -0.204189 -0.393835 -0.379964 -0.227093 -0.230024 0.237842 0.214890 0.266745 0.205523 0.259275 0.219938 0.215131 0.239622 0.236451 0.221558 0.278918 0.293276 0.239844 0.241784
chargesum: 0.00000
title: Mulliken charges with hydrogens summed into heavy atoms:
elementType: O O O C C C C C C C C C C C C C C C
charge: -0.245581 -0.173191 -0.135216 0.216084 0.151977 0.056265 0.112495 -0.051694 -0.044379 -0.012606 0.366628 -0.165603 0.306103 -0.204189 -0.114917 -0.086687 0.012751 0.011759
polarizability: 2.33979075e+02 1.46272895e+01 2.02239531e+02 -2.33203596e+00 2.11348844e+00 9.15684284e+01
1716.lowfreq: -7.0784 -5.8353 -0.0009 -0.0008 0.0007 6.6491 42.0239 67.3237 76.1801
frequency: 42.0083 67.3189 76.1613 130.9790 146.9892 161.8699 204.0574 208.4858 224.2733 240.3458 267.5576 277.0969 285.6728 302.4879 339.9071 358.2825 383.8652 386.9176 417.3646 434.9849 460.1972 464.3562 539.9824 569.5923 577.2020 634.4866 646.7969 681.5600 690.4065 729.1790 746.8162 786.1899 792.6782 861.9088 867.8450 878.3660 922.3185 939.3664 960.5687 961.8430 986.1398 997.8119 1009.3040 1027.1253 1036.1783 1049.9902 1069.2134 1122.2448 1136.1966 1173.6924 1176.6030 1191.5517 1210.7236 1221.5230 1275.1055 1292.7801 1319.4469 1343.9896 1377.6800 1379.3929 1389.6246 1392.6305 1401.8548 1436.0665 1455.5824 1461.6722 1471.1069 1478.5960 1483.9590 1485.4354 1495.0605 1542.1776 1570.9700 1574.8814 1612.2719 1618.8444 2977.5037 2982.0670 2996.7843 3001.3227 3068.8333 3077.0526 3090.5030 3092.1775 3101.0723 3110.1840 3138.3649 3151.7134 3163.2031 3173.9756
redmass: 4.0418 6.5016 4.4011 4.7506 3.9738 3.8630 3.7513 1.1563 1.1126 3.3810 2.7750 1.5768 1.5241 3.6898 7.4700 6.3380 4.1850 4.1476 4.9637 4.6875 4.6814 5.8285 3.4723 4.3920 4.5154 5.8437 6.2214 4.9317 6.7659 3.9789 3.2548 1.6896 3.0732 3.2473 3.2543 6.3486 1.7945 1.5580 2.2161 4.7991 1.4014 1.3305 1.3694 1.6257 2.0533 2.0700 2.4300 2.2516 2.2452 1.2122 2.1692 2.8938 2.7701 2.8960 1.6063 1.6391 2.9873 1.6678 1.3397 2.4214 5.2999 1.3688 1.3238 2.3836 1.0464 1.0471 1.0627 1.0782 2.2281 1.1948 1.0613 9.9552 8.4121 7.8691 10.0902 8.1538 1.0368 1.0361 1.0500 1.0715 1.0999 1.0999 1.0984 1.0999 1.0987 1.1003 1.0862 1.0905 1.0951 1.1001
irintensity: 0.7761 0.6332 1.5343 0.5911 2.8839 2.3929 0.1771 0.4897 0.0234 2.6293 0.5519 0.6265 0.5922 2.6215 1.5964 1.7821 0.0742 2.7866 1.3189 2.4444 5.4308 3.7667 4.7208 3.9990 2.1594 7.2186 0.5504 28.4960 4.5263 5.0174 2.6827 58.4065 39.9657 3.7929 4.2295 34.8820 0.0902 1.5112 6.3996 18.7721 4.1347 11.6167 0.1808 44.5546 4.0771 40.0275 23.1705 9.2453 32.1179 2.7598 0.1737 4.9543 67.3836 24.7885 29.5704 34.5282 17.0798 7.2369 26.6823 86.6164 10.3235 22.1529 19.7832 6.0041 4.4386 9.5171 36.3594 12.3193 24.1117 5.8534 18.7072 282.0596 10.8822 100.0217 53.5333 5.2612 29.9897 29.6671 17.5820 30.2032 26.2815 41.8791 21.4571 5.9334 8.9028 24.0145 2.9132 5.1912 8.3637 18.5524
temp: 298.150 k
press: 1.00000 atm
elementType: 8 8 8 6 6 6 6 6 6 6 6 6 6 6 6 6 6 6 1 1 1 1 1 1 1 1 1 1 1 1 1 1
symmnumber: 1
zpe: 658307.8 jmol-1
zpe.correction: 0.250736 hartree
zpe.thermalcorrener: 0.266586 hartree
zpe.thermalcorrenthalpy: 0.267531 hartree
zpe.thermalcorrgfe: 0.208331 hartree
zpe.sumelectzpe: -804.378775 hartree
zpe.sumelectthermal: -804.362925 hartree
zpe.sumelectthermalent: -804.361981 hartree
zpe.sumelectthermalfe: -804.421181 hartree
dipole: 0.8543 -6.5560 -0.2826
dipole: 6.6175
quadrupole: -84.0538 -120.9306 -104.9826
quadrupole: 3.7004 -1.1101 -0.0476
quadrupole: 19.2685 -17.6082 -1.6603 3.7004 -1.1101 -0.0476
hfenergy: -804.6295117 hartree
pointgroup: C01 [X(C15H14O3)]
dipole: -0.3102627 -2.5815918 0.1320329 debye
polarizability: 234.2687763|-14.3247614|201.9081476|-2.1960624|-3.0268226|91.6101107 unknown
InChI: InChI=1S/C15H14O3/c1-8-15(2,3)11-13(17)12(16)9-6-4-5-7-10(9)14(11)18-8/h4-8H,1-3H3
charge 0 multiplicity 1
32 atoms
O  -1.050864 -1.853931 0.17299
O  -0.986462 2.866579 -0.118972
O  1.837813 2.836266 -0.035692
C  -2.507156 0.151269 0.053895
C  -2.488591 -1.376492 0.442163
C  -1.006588 0.466911 0.093547
C  -0.276704 -0.706843 0.112038
C  -3.326305 0.959732 1.090047
C  -3.044037 0.425313 -1.378651
C  -3.438381 -2.332383 -0.265329
C  1.178702 -0.804812 0.050911
C  -0.363935 1.760522 -0.016631
C  1.911784 0.420922 -0.009259
C  1.201834 1.747635 -0.019141
C  1.861413 -2.043466 0.05785
C  3.323931 0.383047 -0.059574
C  3.273241 -2.065434 0.002191
C  4.004889 -0.854749 -0.055263
H  -2.588696 -1.466288 1.542071
H  -2.938668 0.809814 2.114271
H  -3.265838 2.035893 0.857974
H  -4.389634 0.653933 1.070645
H  -2.925081 1.497486 -1.610765
H  -2.491927 -0.154215 -2.140454
H  -4.117649 0.173099 -1.456593
H  -3.302738 -2.304756 -1.358587
H  -3.273174 -3.366242 0.083333
H  -4.483869 -2.056937 -0.035918
H  1.285624 -2.97233 0.107728
H  3.866235 1.333286 -0.102279
H  3.802829 -3.023986 0.005529
H  5.0988 -0.877845 -0.096276
