program: Gaussian 09
title: 000262090
version: EM64L-G09RevD.01
frameworkgroup: C1[X(C9H9Cl2NO3)]
method: RPBEPBE
basis: SDD
operation: Freq
keyword: #p
keyword: freq=noraman
keyword: PBEPBE/SDD
title: #p freq=noraman PBEPBE/SDD
converged: YES YES NO NO
title: Mulliken charges:
elementType: Cl Cl O O O N C C C C C C C C C H H H H H H H H H
charge: -0.022150 -0.013059 -0.435685 -0.454785 -0.219652 -0.654733 -0.190953 -0.212155 0.399670 -0.408736 -0.389958 0.187440 -0.061393 -0.194495 -0.108325 0.253292 0.280099 0.297310 0.307049 0.320635 0.291854 0.256773 0.372926 0.399031
chargesum: 0.00000
title: Mulliken charges with hydrogens summed into heavy atoms:
elementType: Cl Cl O O O N C C C C C C C C C
charge: -0.022150 -0.013059 -0.062759 -0.055753 -0.219652 -0.042244 0.062339 0.067944 0.399670 -0.111426 -0.082908 0.187440 -0.061393 0.062278 -0.108325
polarizability: 1.67232464e+02 -4.54263467e+00 1.34896868e+02 -1.90460731e+01 2.50804915e+00 8.65978954e+01
1716.lowfreq: -8.7142 -5.3692 -2.8809 -0.0010 0.0022 0.0026 14.2881 43.0585 70.9982
frequency: 12.7502 43.0314 70.9969 96.3998 129.9509 159.1212 173.2021 186.6580 204.0735 235.4659 283.5969 294.0589 299.4975 366.6017 383.0722 420.8725 441.1200 461.5095 463.2378 513.6692 534.0407 549.6004 570.5418 599.2725 623.1998 647.8642 664.7443 693.9188 732.3373 794.9775 834.9186 867.7848 927.3455 976.3460 993.4180 995.9935 1006.2597 1049.3302 1115.9568 1122.1565 1139.3667 1163.2538 1197.0485 1209.8105 1217.8666 1249.0759 1268.1082 1325.4082 1359.5403 1376.6647 1378.7895 1384.1449 1453.9014 1563.4422 1593.1923 1613.5736 1679.9018 2916.7071 3035.6019 3153.8583 3170.7369 3173.2490 3474.2384 3485.8219 3523.2170 3628.3175
redmass: 7.7543 9.6343 9.8997 7.2198 6.6963 5.4654 8.0814 11.4959 2.9666 1.6743 6.3046 8.8905 3.8862 6.7221 4.6385 9.6817 3.3829 3.6157 3.9576 5.3396 1.1865 3.3113 1.4990 2.5292 1.7798 5.0432 6.7348 4.5453 3.3834 6.1516 1.5350 2.2897 1.5030 4.7735 4.7013 1.3570 4.6393 2.9273 1.9055 1.5615 1.5353 1.5987 2.2150 1.4097 1.5509 1.3538 1.5293 1.5001 3.1086 1.9417 2.1252 1.7915 2.6971 8.5257 6.6874 1.2750 4.2485 1.0811 1.0850 1.0892 1.0940 1.0942 1.0652 1.0468 1.0644 1.0985
irintensity: 0.0656 0.4248 1.8646 0.5362 0.1428 2.2248 1.3077 1.8382 6.1093 14.9619 2.8845 1.1047 3.1043 2.9553 5.1575 2.1344 23.8990 24.6086 22.3503 39.8691 57.5912 81.4583 39.6045 96.7230 368.5390 12.4171 10.0271 9.0938 0.3941 15.3290 37.9852 1.6423 13.4792 42.1300 38.8772 5.3504 22.9460 262.6032 26.2501 7.6228 1.1243 17.8078 11.0337 29.6970 11.5930 0.8569 2.5656 36.3936 0.7594 15.9399 55.9569 14.6903 86.1579 11.2556 10.2741 165.4621 127.0549 33.5015 16.2425 3.4798 0.7744 7.4620 49.4909 16.6401 34.8598 22.9828
temp: 298.150 k
press: 1.00000 atm
elementType: 17 17 8 8 8 7 6 6 6 6 6 6 6 6 6 1 1 1 1 1 1 1 1 1
symmnumber: 1
zpe: 444255.6 jmol-1
zpe.correction: 0.169208 hartree
zpe.thermalcorrener: 0.184151 hartree
zpe.thermalcorrenthalpy: 0.185096 hartree
zpe.thermalcorrgfe: 0.125313 hartree
zpe.sumelectzpe: -1547.779599 hartree
zpe.sumelectthermal: -1547.764655 hartree
zpe.sumelectthermalent: -1547.763711 hartree
zpe.sumelectthermalfe: -1547.823494 hartree
dipole: 4.6167 -0.7679 0.3659
dipole: 4.6944
quadrupole: -99.2357 -102.3544 -97.3793
quadrupole: -0.8315 -2.2109 10.1595
quadrupole: 0.4208 -2.6979 2.2771 -0.8315 -2.2109 10.1595
hfenergy: -1547.9488068 hartree
pointgroup: C01 [X(C9H9Cl2N1O3)]
dipole: 1.7245334 0.4353658 -0.4976049 debye
dipolederiv: -0.2943294 -0.2516972 0.1474633 -0.3106037 -0.4172171 0.234029 0.174297 0.2256112 -0.1891459 -0.7233922 -0.0642142 -0.2097575 -0.0718111 -0.0607496 -0.0063585 -0.2471355 -0.0075733 -0.1279566 -0.8038687 0.0291724 -0.0560846 0.077787 -0.4609726 0.2512901 -0.0302723 0.1927443 -0.5113777 -0.4789351 0.035008 0.0471383 0.075709 -1.040131 0.3045842 0.0744807 0.2323745 -0.426834 -0.2883834 -0.0319872 -0.0252723 0.0329169 -0.539027 -0.0480462 0.1766227 0.1681413 -0.9610067 -0.7782047 0.0459331 0.1418217 0.0516838 -0.6245461 0.1791754 0.1555809 0.1160843 -0.3622607 0.5289558 -0.1092352 0.0291852 -0.1806521 0.3323276 -0.2140898 0.1021717 0.005282 0.431749 0.3147498 0.0361061 -0.0437225 0.0768788 0.3419409 -0.2382901 -0.0999032 -0.3704314 -0.0861206 0.1102057 0.0568983 -0.0011565 0.1276262 -0.0213863 -0.0012359 0.1297725 0.0067912 -0.098177 -0.2481999 -0.1139583 0.1061947 -0.0761183 -0.1885298 0.0605787 -0.017968 0.0028795 -0.0752551 -0.184184 0.0387618 0.0014142 0.0197332 -0.0592607 -0.0626733 0.0078739 -0.0534942 -0.0783354 0.2375948 0.0815432 0.0671662 -0.1054956 1.194751 -0.0823496 -0.2324476 -0.2067339 1.2718031 0.2207982 0.4582001 -0.3288496 0.4107743 0.5736848 -0.4064907 -0.2734379 -0.3483407 0.1832261 -0.1909671 0.0140801 -0.0466467 -0.0654773 -0.0320094 -0.0699748 -0.001383 -0.0564048 -0.041989 0.9198218 -0.0102195 0.4329526 0.0819302 -0.1030066 0.0813693 0.3765836 0.0390359 0.0646548 -0.040071 -0.0193321 -0.0251359 -0.017063 -0.0589409 -0.0416923 -0.0505849 -0.0766304 -0.0090812 -0.1341772 0.0413648 -0.0627782 0.0533975 -0.0108385 0.02718 -0.0532922 0.0591341 0.0284121 0.1530561 0.0209515 -0.0417246 0.006062 0.0912778 0.0525538 -0.0154439 0.06082 0.0933098 0.1831276 -0.0402746 0.000544 -0.0235548 0.0814256 0.0435689 0.0049556 0.0514222 0.0950338 0.314566 -0.0266209 0.0370257 -0.0314913 0.2431663 -0.0265618 0.012057 0.0397472 0.1396712 0.2763249 -0.1205115 -0.0698951 -0.0515206 0.1771772 -0.0027784 -0.0784457 -0.007922 0.1580274 0.0586603 0.0148678 -0.0482722 0.0120539 0.0688902 0.0841284 -0.0643404 0.0847265 0.0588031 0.4367969 -0.0347138 -0.0230625 -0.0397994 0.2038121 -0.0856228 -0.0466093 -0.0739227 0.3075895 0.4100551 -0.0501226 -0.0285476 -0.0529655 0.308162 -0.0322935 -0.0031316 -0.083341 0.13526 unknown
polarizability: 160.7257073|24.680533|118.2634169|8.5592813|-24.6596317|109.7381029 unknown
InChI: InChI=1S/C9H9Cl2NO3/c10-5-2-1-4(3-6(5)11)8(13)7(12)9(14)15/h1-3,7-8,13-14H,12H2
charge 0 multiplicity 1
24 atoms
Cl -3.07528 -2.051889 1.587433
Cl -4.34989 -0.123529 -0.761089
O  1.894529 -0.384609 2.089653
O  2.362713 -1.516166 -0.426461
O  2.38301 -0.082125 -2.255609
N  2.482133 2.152663 -0.632989
C  1.465762 0.677333 1.180457
C  2.54533 0.854053 0.033117
C  0.027544 0.481101 0.683062
C  -0.77107 -0.536892 1.256123
C  -0.534413 1.318609 -0.315916
C  2.422673 -0.244049 -1.020269
C  -2.097504 -0.728444 0.821471
C  -1.862527 1.123744 -0.746484
C  -2.646883 0.096451 -0.181122
H  1.525242 1.599019 1.786689
H  3.512492 0.674832 0.558467
H  -0.361179 -1.160334 2.055125
H  0.078335 2.115803 -0.745981
H  2.58091 2.114022 -1.651524
H  2.999996 2.906519 -0.181233
H  -2.297682 1.76394 -1.519613
H  2.034965 -1.206123 1.543832
H  2.242797 -2.21663 -1.122639
