program: Gaussian 09
title: 000262076
version: EM64L-G09RevD.01
frameworkgroup: C1[X(C9H10N2O2)]
method: RPBEPBE
basis: SDD
operation: Freq
keyword: #p
keyword: freq=noraman
keyword: PBEPBE/SDD
title: #p freq=noraman PBEPBE/SDD
converged: NO YES NO NO
title: Mulliken charges:
elementType: O O N N C C C C C C C C C H H H H H H H H H H
charge: -0.202097 -0.201745 -0.296483 0.082778 0.480091 0.450353 -0.341967 -0.319625 -0.379417 -0.375304 -0.803005 0.224175 -0.747421 0.249514 0.254038 0.236103 0.236337 0.228229 0.228158 0.240874 0.246260 0.254161 0.255992
chargesum: 0.00000
title: Mulliken charges with hydrogens summed into heavy atoms:
elementType: O O N N C C C C C C C C C
charge: -0.202097 -0.201745 -0.296483 0.082778 0.480091 0.450353 -0.092453 -0.065587 -0.143314 -0.138967 -0.105744 0.224175 0.008992
polarizability: 1.67930429e+02 5.92643709e+00 1.20391826e+02 3.28531075e+00 -7.81015124e+00 7.61732993e+01
1716.lowfreq: -46.5059 -10.8766 -4.9747 -0.0007 -0.0002 0.0005 7.3967 48.8262 64.0332
frequency: -45.7777 48.7444 64.0274 73.7541 137.8400 148.8866 181.3157 207.1216 242.6051 314.1367 323.8878 351.6773 403.0426 437.8997 444.4503 489.6333 513.1961 590.7494 617.6390 635.2805 672.0670 715.5545 794.8423 808.7100 834.3849 869.9297 942.9383 967.0794 977.0068 991.5872 1009.0818 1032.6497 1035.5906 1047.0064 1128.1941 1170.8826 1197.8321 1224.8121 1287.6733 1310.7955 1374.1398 1387.8109 1397.4011 1398.1919 1412.3449 1445.5423 1455.6319 1470.7192 1471.9482 1499.0742 1585.6297 1617.8664 1635.8619 2977.5817 3013.3855 3059.5518 3088.8755 3102.8496 3132.4057 3134.7723 3137.8333 3170.5994 3175.0454
redmass: 1.0177 4.3310 3.9452 5.0330 5.3825 1.0666 4.9399 8.2449 7.5879 3.8301 3.7166 3.4967 2.8412 8.0707 6.0144 4.7175 2.9514 3.3508 4.1770 6.4341 6.4300 3.2674 4.3987 1.6725 1.2572 3.6634 1.5022 1.3931 2.6953 1.7243 3.0609 2.0176 1.7028 1.5727 1.2916 2.6037 1.2298 3.0227 6.1014 1.3159 5.6242 1.2250 9.4893 1.2227 3.5281 1.0716 1.0474 1.1007 1.0554 2.5991 6.4889 6.3773 9.1517 1.0390 1.0363 1.0947 1.0999 1.0968 1.0897 1.0898 1.1019 1.0954 1.0961
irintensity: 0.4910 0.4438 4.6135 3.3212 0.8356 0.3555 0.6449 9.8097 0.2593 1.0305 4.6242 0.6445 0.2439 17.5800 2.7059 12.4389 19.1862 0.8167 36.4537 0.7693 70.5344 15.4475 23.9365 19.6161 1.9505 176.1836 2.6929 0.3884 18.5466 9.0787 1.5768 11.6117 7.3352 20.7105 13.1376 75.2333 10.3719 5.0706 168.8082 6.3158 6.4462 53.3083 191.8370 14.5167 25.9767 18.1450 19.8386 11.8645 12.7628 35.7991 1.1390 22.0591 97.7986 27.4463 0.7359 20.4506 16.5297 5.1003 14.0510 16.6271 12.1810 7.6991 1.0306
temp: 298.150 k
press: 1.00000 atm
elementType: 8 8 7 7 6 6 6 6 6 6 6 6 6 1 1 1 1 1 1 1 1 1 1
symmnumber: 1
zpe: 456911.1 jmol-1
zpe.correction: 0.174028 hartree
zpe.thermalcorrener: 0.186128 hartree
zpe.thermalcorrenthalpy: 0.187072 hartree
zpe.thermalcorrgfe: 0.135180 hartree
zpe.sumelectzpe: -607.900076 hartree
zpe.sumelectthermal: -607.887976 hartree
zpe.sumelectthermalent: -607.887032 hartree
zpe.sumelectthermalfe: -607.938925 hartree
dipole: -1.2702 -0.3095 -0.0668
dipole: 1.3090
quadrupole: -59.4241 -85.9575 -74.3148
quadrupole: -0.5876 0.3711 -8.7040
quadrupole: 13.8080 -12.7254 -1.0827 -0.5876 0.3711 -8.7040
hfenergy: -608.0741043 hartree
pointgroup: C01 [X(C9H10N2O2)]
dipole: -0.5002189 -0.1173386 -0.0352876 debye
dipolederiv: -0.5883702 -0.0866636 -0.0524411 0.1714634 -0.9002371 -0.2539657 0.0955508 -0.2332634 -0.3786731 -0.0219751 0.5942962 0.2593533 -0.2561002 -1.0036939 -0.3451762 -0.1455292 -0.3311087 -0.2637107 -0.5443342 -0.003337 -0.0139309 0.266974 -1.2096714 -0.4004059 0.0579949 -0.39459 -0.2410322 -0.2403054 -0.0465983 -0.0211627 0.4597398 1.4978539 0.6359171 0.2319046 0.6029159 0.2039854 0.3000621 -0.0185411 -0.0050155 0.0065198 -0.0824684 -0.139788 0.0060066 -0.0610128 0.063523 0.5000881 0.0571359 0.0290507 0.1172045 0.0260865 0.0021284 0.0649834 -0.0209682 -0.0114002 0.0566508 0.091886 -0.0016892 -0.0105715 -0.0207978 -0.067815 0.0610853 -0.0304716 -0.0509998 0.0457477 -0.0752226 0.0145647 0.0276657 0.0398053 -0.037237 -0.0448476 -0.0255883 -0.0552038 -0.2435252 -0.1404073 0.0460836 -0.1879332 -0.0315107 -0.1096789 0.1332496 -0.0681267 -0.0874998 -0.242006 0.0837566 -0.0494466 0.1316647 0.0249825 -0.1084123 -0.1112834 -0.0988946 -0.1105877 -0.1859976 -0.0330489 -0.0171435 -0.1027594 0.0611842 -0.0103056 -0.1270603 -0.0263213 0.060605 1.3036568 -0.4272775 -0.1543209 -0.6294564 1.366674 0.4907449 -0.2057513 0.4074298 0.3518766 -0.475973 -0.0356427 -0.0191323 -0.1235483 0.0218959 -0.0046546 -0.069558 0.0060163 0.0163821 0.0525005 -0.0682433 0.0388163 -0.0691624 0.0325233 0.0796269 0.0200661 0.0376169 0.0876106 0.0396155 0.0672604 -0.048027 0.0655993 0.0527674 0.0698648 -0.0438154 0.0402818 0.094476 -0.0042705 0.0739126 -0.0599363 0.0827798 0.0243602 0.0931217 -0.048422 0.0847102 0.0889193 0.018366 -0.0773681 0.0454024 -0.079936 -0.0015125 0.0932866 0.042888 0.0933685 0.089348 0.0215061 -0.0115913 0.0245341 -0.0409329 0.0570017 0.1029163 0.11923 0.0900486 -0.0567453 0.0072737 0.0374757 0.0001319 0.1365982 -0.0902571 0.0192089 0.0068917 0.0381277 0.1070655 -0.0222311 -0.0355173 -0.0367405 -0.0609305 0.0409062 -0.1017612 -0.0722793 -0.1014785 -0.0265469 0.0310492 0.0444958 0.0170388 0.1205501 -0.0283239 -0.0555127 0.0373858 -0.0539362 0.1049284 0.0902678 0.0046688 0.0038901 -0.0025835 0.1124262 -0.046387 -0.0307621 -0.032352 -0.0475903 0.1022043 0.0045711 0.0001205 -0.0228452 0.0100055 0.0942845 0.0220719 0.0775968 0.0612699 unknown
polarizability: 167.9911787|5.4486133|121.3983426|3.4567294|-3.757558|75.1060336 unknown
InChI: InChI=1S/C9H10N2O2/c1-7-3-5-9(6-4-7)11(10-13)8(2)12/h3-6H,1-2H3
charge 0 multiplicity 1
23 atoms
O  1.818956 -1.985212 -0.707025
O  1.38864 2.340524 0.846529
N  1.431204 0.190345 0.052072
N  2.131576 1.378849 0.497048
C  -0.009858 0.073265 0.025545
C  -2.845466 -0.136704 0.003966
C  -0.782605 1.040016 -0.659657
C  -0.643849 -0.993371 0.705632
C  -2.187741 0.928459 -0.663576
C  -2.048725 -1.092339 0.687075
C  -4.356912 -0.266936 -0.03426
C  2.307303 -0.897243 -0.317872
C  3.798633 -0.637598 -0.210618
H  -0.295132 1.865847 -1.185152
H  -0.043028 -1.74166 1.2297
H  -2.782969 1.681434 -1.192978
H  -2.534234 -1.924191 1.21036
H  -4.745352 -0.75304 0.877687
H  -4.847462 0.716928 -0.134141
H  -4.677817 -0.883442 -0.896497
H  4.32034 -1.549191 -0.538024
H  4.090617 -0.390433 0.8239
H  4.105682 0.215694 -0.838014
