program: Gaussian 09
title: 000262070
version: EM64L-G09RevD.01
frameworkgroup: C1[X(C10H12O)]
method: RPBEPBE
basis: SDD
operation: Freq
keyword: #pfreq=noraman
keyword: PBEPBE/SDD
title: #p freq=noraman PBEPBE/SDD
converged: NO YES NO NO
title: Mulliken charges:
elementType: O C C C C C C C C C C H H H H H H H H H H H H
charge: -0.287358 0.440331 0.349374 -0.329659 -0.421700 -0.378639 -0.343058 -0.808825 -0.316541 -0.108422 -0.552543 0.229353 0.226367 0.247217 0.241270 0.222258 0.228388 0.228367 0.223908 0.223841 0.248835 0.223838 0.213395
chargesum: 0.00000
title: Mulliken charges with hydrogens summed into heavy atoms:
elementType: O C C C C C C C C C C
charge: -0.287358 0.440331 0.349374 -0.100306 -0.195333 -0.131422 -0.101788 -0.129811 0.131208 0.140413 -0.115310
polarizability: 1.73989242e+02 -5.59665981e+00 1.05576433e+02 -3.22749738e-02 1.76411726e-02 5.40639232e+01
1716.lowfreq: -94.9366 -13.8527 -6.5161 -0.0009 -0.0007 0.0001 14.9765 44.0198 50.1384
frequency: -94.8964 43.9793 50.0551 97.9287 121.4953 150.1676 265.3641 292.3751 328.6744 355.5291 413.6147 485.5712 506.9119 524.8355 558.1750 633.9674 710.2263 737.4081 806.2062 818.7084 827.8937 907.5046 927.5810 935.3331 962.2754 981.5631 985.0934 1000.5139 1004.9625 1016.1382 1047.1643 1120.4579 1137.5671 1180.4869 1185.4969 1218.2046 1226.4744 1275.8286 1305.1927 1331.0482 1373.1375 1397.5603 1415.1376 1429.5548 1465.1103 1470.0888 1476.4782 1503.0293 1585.4451 1627.3340 1663.9460 2937.0568 2971.8464 2990.4172 3048.4213 3078.8170 3089.7322 3120.7270 3123.3262 3130.0236 3158.1609 3162.2521 3199.6637
redmass: 1.9672 2.5480 1.2488 3.7317 1.9539 4.2195 3.1511 4.4202 4.2029 2.7847 2.9268 3.4951 2.4437 5.7533 1.3813 6.7760 2.9867 4.9551 1.4206 5.9783 1.3641 1.8758 1.3217 1.3196 1.3457 1.5316 1.0934 4.0166 2.6501 1.6098 1.5272 1.2711 2.0659 1.2480 1.0616 2.1019 5.4506 1.2926 1.2915 1.3244 4.4794 1.2470 3.5181 1.2084 1.1121 1.0457 1.0993 2.5166 6.4638 6.4165 4.9360 1.0549 1.0371 1.1057 1.0977 1.0984 1.0619 1.0893 1.0889 1.0940 1.0941 1.0955 1.1134
irintensity: 3.6079 1.3496 0.0061 0.2782 3.8480 0.2020 0.5981 1.0185 6.1993 1.3969 0.0791 0.3777 17.8541 3.1142 22.6663 0.1205 0.4559 11.6362 41.1968 6.7688 32.6936 5.3979 1.4311 72.7254 0.1851 12.8987 27.5657 54.5199 4.8691 8.2898 11.1696 16.1622 12.5727 55.6918 0.5314 98.7823 125.3165 6.2763 0.9479 12.1616 5.5310 9.3676 4.9692 18.1913 53.6515 12.3575 12.8455 122.1183 13.5390 27.1961 11.4999 27.9638 48.3397 38.0101 24.5760 20.4071 9.6564 17.0684 25.2975 2.5678 20.5809 3.0677 23.6862
temp: 298.150 k
press: 1.00000 atm
elementType: 8 6 6 6 6 6 6 6 6 6 6 1 1 1 1 1 1 1 1 1 1 1 1
symmnumber: 1
zpe: 495823.6 jmol-1
zpe.correction: 0.188849 hartree
zpe.thermalcorrener: 0.199399 hartree
zpe.thermalcorrenthalpy: 0.200343 hartree
zpe.thermalcorrgfe: 0.151695 hartree
zpe.sumelectzpe: -462.636141 hartree
zpe.sumelectthermal: -462.625592 hartree
zpe.sumelectthermalent: -462.624648 hartree
zpe.sumelectthermalfe: -462.673296 hartree
dipole: -0.0689 -1.3383 0.0053
dipole: 1.3401
quadrupole: -56.4339 -60.1885 -71.1345
quadrupole: -2.9565 0.0011 0.0096
quadrupole: 6.1517 2.3971 -8.5488 -2.9565 0.0011 0.0096
hfenergy: -462.8249906 hartree
pointgroup: C01 [X(C10H12O1)]
dipole: 0.0329258 0.5222836 0.0640974 debye
dipolederiv: -1.9182361 0.0877875 0.0441583 -0.0231132 -0.3058347 -0.0016852 0.0308259 -0.0042579 -0.2900672 0.2719158 0.0726513 0.0023128 0.0077214 -0.1878623 -0.0159331 -0.0052964 -0.0172349 -0.0573001 1.5992237 0.0466995 -0.0252466 0.3359089 0.0305305 -0.0143818 0.0099173 -0.0081443 0.0890721 0.0294799 0.0262179 -0.0007474 -0.0950161 0.1447118 0.0393408 -0.0152972 0.0370133 -0.1645697 0.0080483 -0.1023537 -0.0156707 0.1025729 0.131845 0.0332657 0.0087223 0.0372514 -0.1601331 -0.3751537 -0.0537782 -0.0022272 0.1847348 0.0530062 0.0239202 0.0263695 0.0286447 -0.1750903 -0.2954128 0.0469367 0.0074363 -0.3325047 -0.0455706 0.0259479 -0.038286 0.0182522 -0.2012735 -0.1015413 -0.0154585 0.0017936 0.0563341 0.0875868 -0.0005787 0.010205 0.0008799 0.0829031 0.7834319 -0.1611172 -0.0264103 -0.62683 0.314113 -0.0029285 -0.0832327 -0.0123613 0.4468519 0.272121 0.0149484 -0.0081741 0.1630497 0.0901563 0.0320409 0.0096487 0.0350359 -0.2021886 -0.244013 0.0717355 0.0045641 0.0753149 0.0866904 0.059955 0.0053249 0.0600445 -0.4220027 -0.0202668 0.1159806 0.0171974 0.108011 -0.0305476 -0.0234141 0.0161779 -0.0236208 0.1443662 0.0324095 -0.0833705 -0.0075691 -0.0874405 -0.0896922 -0.0268638 -0.0080785 -0.0269556 0.1469992 0.0707478 -0.0742566 -0.00695 -0.0677329 -0.0403259 -0.0236778 -0.0061599 -0.0234663 0.1665307 -0.0027262 0.0998348 0.0154647 0.1278269 -0.0077275 -0.0239337 0.0188665 -0.0234142 0.166873 0.0552019 0.0028757 0.0013634 -0.1176683 -0.1408608 -0.0271386 -0.0129873 -0.0295605 0.1034467 -0.0533581 0.0214812 -0.0639442 0.0596722 0.0389669 0.1063853 -0.129427 0.0802159 -0.0253894 -0.0454333 0.0031183 0.0668653 0.0238934 0.0781199 -0.0821251 0.1393535 -0.0547569 -0.0724543 -0.0712799 -0.0199643 -0.0427988 0.1083682 -0.0108828 -0.0926098 -0.0053285 -0.0920586 -0.0902128 -0.0685613 -0.0250718 0.0369869 0.1079141 -0.0580996 0.0964576 0.0317442 0.1012534 -0.0456235 0.0793763 0.0218547 0.0048393 -0.0443028 -0.0589193 -0.0279184 -0.0033189 -0.0292814 0.1795691 -0.1039312 -0.0695791 -0.0019784 -0.0777087 0.0391245 -0.017024 -0.0030062 -0.0172055 0.1935475 0.0979576 -0.0271723 -0.0012652 0.0109947 -0.118528 -0.0371006 0.0032627 -0.0362731 0.1861457 unknown
polarizability: 173.8089828|-6.0127728|104.9491109|-3.1599593|6.2111702|54.8715043 unknown
InChI: InChI=1S/C10H12O/c1-3-8-11-10-6-4-9(2)5-7-10/h3-7H,1,8H2,2H3
charge 0 multiplicity 1
23 atoms
O  -1.386527 -0.673823 0.067429
C  2.793706 0.136678 0.080977
C  -0.023471 -0.328951 0.081063
C  2.263565 -1.176183 -0.065411
C  1.876114 1.202218 0.226482
C  0.878202 -1.413026 -0.066461
C  0.476363 0.987047 0.228749
C  4.294504 0.372665 0.079699
C  -2.365423 0.414915 0.220761
C  -3.734042 -0.22929 0.172553
C  -4.906282 0.440766 0.277343
H  2.950489 -2.024017 -0.18023
H  2.253852 2.225706 0.341149
H  0.470111 -2.422518 -0.178915
H  -0.195911 1.842416 0.345102
H  4.534549 1.443192 0.202474
H  4.791573 -0.178583 0.900607
H  4.756876 0.031709 -0.866251
H  -2.196843 0.936282 1.186848
H  -2.236436 1.153271 -0.598895
H  -3.718096 -1.319049 0.042105
H  -5.865449 -0.085487 0.23481
H  -4.950724 1.529865 0.408214
