program: Gaussian 09
title: 000262143
version: EM64L-G09RevD.01
frameworkgroup: C1[X(C24H31NO2)]
method: RPBEPBE
basis: SDD
operation: Freq
keyword: #p
keyword: freq=noraman
keyword: PBEPBE/SDD
title: #p freq=noraman PBEPBE/SDD
converged: YES YES NO NO
title: Mulliken charges:
elementType: O O N C C C C C C C C C C C C C C C C C C C C C C C C H H H H H H H H H H H H H H H H H H H H H H H H H H H H H H H
charge: -0.470409 -0.268560 -0.081373 -0.108625 -0.042464 -0.484770 -0.431044 -0.462436 -0.413562 -0.463801 -0.365121 -0.375522 -0.487701 0.027604 0.387227 0.367002 -0.361984 -0.411613 -0.364075 -0.428750 -0.366315 -0.355727 -0.229933 -0.244673 0.316210 -0.242326 -0.537779 0.208686 0.198182 0.206190 0.207128 0.202830 0.202147 0.221104 0.206480 0.168455 0.212622 0.191009 0.198333 0.196104 0.190348 0.206875 0.229740 0.215944 0.205668 0.342490 0.239032 0.285511 0.265226 0.252853 0.247945 0.237133 0.225802 0.224886 0.228579 0.219421 0.220226 0.243571
chargesum: 0.00000
title: Mulliken charges with hydrogens summed into heavy atoms:
elementType: O O N C C C C C C C C C C C C C C C C C C C C C C C C
charge: -0.127919 -0.268560 -0.081373 0.100061 0.155718 -0.071452 -0.026067 -0.034853 -0.032485 -0.074459 0.021332 0.061094 -0.066089 0.027604 0.387227 0.367002 -0.122951 -0.126102 -0.098849 -0.175897 -0.118370 -0.118594 -0.004131 -0.019786 0.316210 -0.013747 0.145438
polarizability: 2.72183913e+02 1.26385595e+01 3.01181828e+02 4.59089048e+00 1.57160787e+01 2.22029958e+02
1716.lowfreq: -11.9053 -5.6273 -2.0816 -0.0007 -0.0006 -0.0004 15.4060 22.1460 27.0328
frequency: 14.2231 21.7866 26.0383 31.1680 32.8424 46.1935 69.0328 80.2879 93.2633 98.4341 141.0908 154.9892 168.2626 183.9739 207.5799 219.0185 240.0142 248.4447 273.2827 295.0114 297.4038 309.7030 327.6728 343.6521 359.5410 369.2871 373.4890 400.4511 400.6155 412.6367 417.3693 437.5925 474.5250 484.8409 516.8126 541.7193 559.1073 566.3251 615.1264 630.2988 633.7834 664.7317 668.6623 704.8063 724.0627 737.0322 761.0360 762.3222 775.3455 778.0607 791.0542 802.0239 815.9251 820.9511 832.5165 854.2801 860.4353 875.2370 892.2007 908.8265 929.9621 933.9992 946.7758 955.6778 968.5197 971.1780 979.6857 989.0028 990.2389 995.4240 996.6065 1002.7408 1004.9151 1026.1733 1034.1269 1041.6168 1048.8957 1065.2178 1080.7340 1085.2316 1097.9128 1104.6872 1112.0287 1117.3588 1125.2845 1130.2122 1151.7318 1156.3659 1166.7943 1171.8608 1176.0801 1179.1685 1191.6877 1196.2471 1202.9707 1205.7724 1219.5457 1226.3083 1232.1010 1243.4943 1268.2935 1276.4102 1289.5358 1297.6854 1299.2686 1306.0081 1314.1607 1316.0031 1319.4705 1326.1401 1332.8982 1339.1000 1353.8667 1361.6036 1370.1050 1376.5666 1380.1297 1397.3489 1412.8984 1433.6886 1434.9266 1448.9162 1454.2089 1455.1864 1461.1437 1463.7825 1464.6367 1472.3325 1472.6981 1479.6411 1482.7054 1484.3633 1499.5047 1583.9546 1589.0956 1609.4781 1622.1350 2817.5569 2853.1147 2895.5572 2956.4406 2957.6964 2973.8065 2975.8812 2977.9483 2991.3469 2993.4364 3010.1017 3011.8453 3017.5312 3023.2927 3034.3496 3040.2544 3042.9771 3044.3747 3054.1850 3069.1466 3122.1897 3122.7950 3126.3674 3132.1933 3146.9211 3149.7385 3154.9986 3165.0099 3165.8346 3176.7863 3561.9235
redmass: 4.2397 4.2457 3.5826 3.7070 3.6835 4.4389 2.6523 3.8756 3.4505 2.7719 3.3505 3.7841 3.6318 2.9487 2.5275 2.0965 1.9236 2.7616 1.2382 2.9088 3.5983 2.9326 3.3541 3.7309 4.2113 2.0774 3.6996 2.7143 2.5595 2.9903 3.4338 2.1616 2.4595 3.7323 3.0280 4.3540 2.7486 3.7811 6.3836 6.9826 4.1577 2.9173 3.3441 1.6786 3.8877 3.3691 2.8476 1.6029 2.3114 3.4630 1.5890 3.4034 2.4249 1.2882 1.6808 1.2775 2.3530 2.4723 1.9749 3.1333 1.6903 1.6945 1.8972 1.5162 1.6713 1.7277 1.3861 8.3221 6.1216 2.2078 1.3672 2.7025 1.9846 2.2959 2.1473 2.0029 2.8389 2.2288 2.3771 1.8190 1.8732 1.7298 1.2607 1.4775 1.5948 1.6692 1.7966 1.3342 1.3953 1.0587 1.2061 1.3108 1.1306 2.3415 1.3358 1.5879 1.3227 3.1554 1.6679 1.4248 1.3252 1.4078 1.3256 1.3518 1.3108 1.4222 1.4549 1.5098 1.3785 1.3370 1.5275 1.6764 1.3689 1.4170 1.4336 4.1379 6.0706 1.3677 3.8918 2.0312 1.2311 1.0835 1.0894 1.0837 1.0838 1.0884 1.0506 1.0811 1.1056 2.0566 1.1016 1.1016 2.4158 7.4515 6.0589 6.0099 6.4360 1.0705 1.0711 1.0695 1.0330 1.0621 1.0708 1.0618 1.0669 1.0661 1.0759 1.0814 1.0862 1.0886 1.0955 1.0906 1.1023 1.1038 1.1010 1.0973 1.1036 1.0991 1.0845 1.0890 1.0881 1.0924 1.0882 1.0950 1.0949 1.1007 1.0948 1.0658
irintensity: 0.0424 0.1184 0.1621 1.4217 0.0378 0.1545 0.8403 1.8156 1.3475 0.6335 3.9134 0.3047 2.3263 0.3447 0.6073 1.0303 0.7401 0.4230 145.6613 3.4447 12.0658 12.1585 0.2441 24.9271 8.1201 2.7695 1.4956 0.1921 3.1287 0.6802 0.2440 1.5479 2.8378 3.9122 3.3802 10.0830 7.3561 43.8319 0.5084 1.0336 26.4370 3.8195 4.7658 56.9743 6.8684 10.5854 4.3210 2.0268 43.2453 7.3266 2.0665 2.8990 2.4952 9.6060 67.9004 0.8862 10.5738 23.5181 7.5221 10.2446 7.0809 7.4697 5.3805 1.9427 2.5459 7.0279 0.5190 44.1199 0.3705 4.9836 0.7821 9.7823 5.5095 13.0728 2.7383 2.9199 33.1514 18.8133 12.0249 19.9962 0.3106 21.1126 0.1428 2.9396 25.7446 14.6087 43.3799 7.8300 1.8477 0.0865 3.1318 78.9485 4.4527 14.5589 4.8988 1.8401 6.8323 176.2547 0.6043 1.0042 6.4716 9.8791 0.9731 2.5083 7.7124 5.4526 5.4909 2.2821 2.7832 2.6055 16.5156 19.5060 3.9578 9.3263 5.8104 33.1062 4.4356 3.3600 2.1181 11.5320 10.4005 0.2813 1.4814 2.4876 9.9313 15.4223 12.3942 54.9703 27.5282 12.8195 9.1175 4.8512 113.9678 10.7892 1.4623 2.7470 50.0612 98.9860 73.6988 65.3339 76.0262 30.7916 3.5084 29.5928 4.8716 94.0849 101.3632 90.2979 67.1234 19.6039 53.3047 5.1233 38.9624 49.9991 0.7811 52.8625 92.7196 29.1894 0.7492 11.1159 7.1066 24.6801 12.0137 30.4162 7.1591 17.0984 3.8260 6.8182
temp: 298.150 k
press: 1.00000 atm
elementType: 8 8 7 6 6 6 6 6 6 6 6 6 6 6 6 6 6 6 6 6 6 6 6 6 6 6 6 1 1 1 1 1 1 1 1 1 1 1 1 1 1 1 1 1 1 1 1 1 1 1 1 1 1 1 1 1 1 1
symmnumber: 1
zpe: 1301634.1 jmol-1
zpe.correction: 0.495766 hartree
zpe.thermalcorrener: 0.521153 hartree
zpe.thermalcorrenthalpy: 0.522097 hartree
zpe.thermalcorrgfe: 0.437640 hartree
zpe.sumelectzpe: -1136.289826 hartree
zpe.sumelectthermal: -1136.264439 hartree
zpe.sumelectthermalent: -1136.263495 hartree
zpe.sumelectthermalfe: -1136.347952 hartree
dipole: -0.0637 0.1260 -1.2663
dipole: 1.2741
quadrupole: -156.4826 -144.3776 -161.3341
quadrupole: 4.3630 3.6052 6.8800
quadrupole: -2.4178 9.6872 -7.2694 4.3630 3.6052 6.8800
hfenergy: -1136.785592 hartree
pointgroup: C01 [X(C24H31N1O2)]
dipole: -0.0315052 0.0789668 -0.4940084 debye
polarizability: 270.6845189|10.4910989|300.4120588|3.8912087|20.8502821|224.299122 unknown
InChI: InChI=1S/C24H31NO2/c1-27-23-11-9-22(10-12-23)24(26,21-5-3-2-4-6-21)14-16-25-15-13-19-7-8-20(17-19)18-25/h2-6,9-12,19-20,26H,7-8,13-18H2,1H3
charge 0 multiplicity 1
58 atoms
O  -1.220022 1.049222 -2.11205
O  -3.502375 -4.21702 0.724622
N  2.631043 -0.14294 -0.552397
C  4.695417 -1.532789 0.069843
C  5.397063 0.814454 0.294956
C  5.758698 -0.515646 -0.428554
C  4.585581 -1.188318 1.581063
C  4.802394 0.353946 1.674518
C  3.331515 -1.44927 -0.661281
C  4.411787 1.694134 -0.527051
C  3.327864 0.924959 -1.321283
C  1.184004 -0.246149 -0.893732
C  0.366364 0.872239 -0.216746
C  -1.133844 0.880661 -0.630811
C  -1.789895 -0.476591 -0.324542
C  -1.930836 2.032044 0.023308
C  -2.000566 -0.864645 1.025465
C  -2.167706 -1.369401 -1.350071
C  -3.260969 2.257239 -0.424283
C  -1.402956 2.876472 1.030803
C  -2.5670 -2.110956 1.341518
C  -2.744837 -2.626326 -1.049782
C  -4.039564 3.299716 0.117118
C  -2.183763 3.923059 1.576997
C  -2.94209 -2.999152 0.301353
C  -3.502671 4.139897 1.122909
C  -3.920555 -5.16169 -0.312316
H  5.054762 -2.571814 -0.076731
H  6.310423 1.417511 0.465072
H  5.786093 -0.417537 -1.530571
H  6.761443 -0.858294 -0.106061
H  5.374317 -1.726594 2.141521
H  3.609943 -1.493894 2.000387
H  3.839152 0.861503 1.854471
H  5.48209 0.613831 2.50791
H  3.491405 -1.726594 -1.738339
H  2.670568 -2.221279 -0.222607
H  4.982666 2.302939 -1.259687
H  3.918261 2.405572 0.164554
H  2.577166 1.658164 -1.672637
H  3.783311 0.487153 -2.24525
H  1.004879 -0.222552 -1.995568
H  0.81527 -1.222472 -0.531666
H  0.457171 0.741752 0.877714
H  0.80609 1.860735 -0.460523
H  -0.96402 1.984038 -2.318087
H  -1.735519 -0.178122 1.838412
H  -2.012956 -1.071446 -2.390298
H  -3.673313 1.601707 -1.198938
H  -0.382547 2.728732 1.398127
H  -2.736924 -2.415413 2.378753
H  -3.030098 -3.293685 -1.868885
H  -5.063916 3.457713 -0.239153
H  -1.759654 4.56616 2.356622
H  -4.106659 4.949999 1.546916
H  -3.063174 -5.483887 -0.935473
H  -4.705761 -4.72698 -0.961586
H  -4.32735 -6.026099 0.233027
