program: Gaussian 09
title: 000262060
version: EM64L-G09RevD.01
frameworkgroup: C1[X(C9H12O2)]
method: RPBEPBE
basis: SDD
operation: Freq
keyword: #pfreq=noraman
keyword: PBEPBE/SDD
title: #p freq=noraman PBEPBE/SDD
converged: YES YES NO NO
title: Mulliken charges:
elementType: O O C C C C C C C C C H H H H H H H H H H H H
charge: -0.421969 -0.449010 -0.538199 0.211383 -0.357486 0.136104 0.170806 -0.685148 -0.382772 -0.434886 -0.175987 0.264229 0.179575 0.204308 0.230901 0.217811 0.203446 0.222820 0.249212 0.216092 0.226090 0.355215 0.357464
chargesum: 0.00000
title: Mulliken charges with hydrogens summed into heavy atoms:
elementType: O O C C C C C C C C C
charge: -0.066754 -0.091546 -0.094395 0.211383 0.077724 0.136104 0.170806 -0.041070 -0.133561 -0.218793 0.050103
polarizability: 1.31156359e+02 1.92753800e+00 1.14866216e+02 9.66657629e+00 2.03497746e-01 6.10406920e+01
1716.lowfreq: -0.0009 -0.0009 0.0003 4.7335 8.4054 14.2572 41.5102 79.0017 86.1507
frequency: 41.2887 79.0007 86.1315 169.8326 219.4301 228.9542 268.6106 315.5774 325.7300 343.4869 352.5064 372.4548 485.7888 499.5073 535.0546 547.7290 593.4092 676.7199 719.9226 735.6783 770.7565 819.0066 845.9585 849.2860 888.9311 947.3204 947.4820 1047.9833 1058.1557 1085.2649 1092.7814 1137.4890 1158.3971 1176.7097 1215.3816 1226.5839 1260.7841 1280.6678 1294.2120 1304.9420 1343.2130 1388.9075 1405.6219 1453.4685 1473.2889 1475.9594 1479.2350 1491.0128 1494.7485 1602.8944 1630.6153 2932.4905 2971.4592 2980.0734 3032.8929 3057.4401 3071.2024 3075.7602 3118.9257 3150.1402 3180.0571 3573.4023 3589.1312
redmass: 3.4554 4.0373 1.6873 4.8842 1.1351 3.8684 3.4354 2.2828 2.5073 1.4359 1.1941 3.6755 3.7606 5.0106 5.5192 4.4823 4.6396 4.3048 2.0257 1.1118 2.3874 4.3093 1.4368 1.3668 2.0395 1.5225 1.9578 2.9918 2.1080 1.4746 2.1551 1.3646 1.2511 1.6024 1.9613 1.4528 2.1490 1.3140 1.3084 1.7005 1.4499 1.2128 5.3816 2.7255 1.0648 1.0694 1.1043 2.2695 1.2199 6.4795 7.0812 1.0706 1.0361 1.0639 1.0950 1.0928 1.0996 1.0996 1.0886 1.0922 1.0969 1.0651 1.0660
irintensity: 0.1624 0.2142 0.0310 0.4319 0.0376 1.8883 4.1544 3.1372 0.8670 70.3841 194.5970 8.9667 4.3089 4.2331 2.7260 2.3682 0.6830 6.3442 35.8404 2.8123 51.9702 6.3454 2.5362 9.9974 7.8102 22.8979 51.2409 8.6400 52.3393 98.8492 10.1111 130.4148 26.4485 9.4748 58.6083 3.4437 45.2212 1.4907 11.0748 4.6665 1.4247 10.6402 2.2990 84.0142 3.2358 6.7797 6.3970 26.5385 15.2830 93.1492 33.8313 41.8462 44.7262 23.2451 3.8942 5.6879 60.6319 47.7510 11.9058 16.0695 8.4277 25.5777 30.0474
temp: 298.150 k
press: 1.00000 atm
elementType: 8 8 6 6 6 6 6 6 6 6 6 1 1 1 1 1 1 1 1 1 1 1 1
symmnumber: 1
zpe: 496311.8 jmol-1
zpe.correction: 0.189035 hartree
zpe.thermalcorrener: 0.200322 hartree
zpe.thermalcorrenthalpy: 0.201266 hartree
zpe.thermalcorrgfe: 0.151886 hartree
zpe.sumelectzpe: -499.766200 hartree
zpe.sumelectthermal: -499.754913 hartree
zpe.sumelectthermalent: -499.753969 hartree
zpe.sumelectthermalfe: -499.803349 hartree
dipole: -0.2849 1.8942 0.0659
dipole: 1.9166
quadrupole: -58.8423 -62.4795 -69.1525
quadrupole: 7.2111 2.2949 1.2430
quadrupole: 4.6491 1.0119 -5.6611 7.2111 2.2949 1.2430
hfenergy: -499.955235 hartree
pointgroup: C01 [X(C9H12O2)]
dipole: 0.1368418 -0.7414948 -0.0079725 debye
dipolederiv: -0.4637735 -0.510914 -0.0086454 -0.4706105 -1.0182625 0.1088679 -0.038344 0.1089336 -0.3908009 -0.3307197 0.5059895 0.0181312 0.402206 -1.103106 -0.1477449 -0.0127277 -0.1505699 -0.4098808 -0.0457991 0.0259168 -0.0218474 -0.0075918 0.1045708 -0.0695444 -0.1204807 -0.0737904 0.1149441 0.089064 -0.012653 -0.0392094 -0.0250671 -0.4843631 -0.0039495 -0.076168 -0.0120819 -0.1437422 0.0651103 -0.0101296 0.0219714 -0.0143161 0.1394511 0.0283897 0.1437155 0.0115869 0.0672703 0.4974547 0.4513397 -0.0900898 0.3985026 0.9496699 -0.0736515 -0.0719335 -0.0803988 0.0960099 0.3832442 -0.3820345 -0.1050668 -0.2337906 1.0705756 0.1216919 -0.0664264 0.1342622 0.0991963 -0.0993402 0.0029185 0.0008563 -0.003674 0.1049825 -0.0107493 -0.0735496 -0.0089865 0.0654428 -0.2725162 -0.2709526 0.0024093 -0.0551328 -0.1619626 0.014859 0.0162014 0.076314 -0.2137632 -0.2865429 0.2964126 0.0196881 0.020617 -0.2178522 -0.0057795 0.011412 -0.0738336 -0.246853 0.0837492 0.0022311 -0.0647093 0.025384 0.3029065 0.0106161 -0.0508808 0.0178847 -0.1134725 0.0620316 0.0304529 0.0164361 0.0763546 -0.0045851 -0.0972981 0.0052037 -0.0434524 0.0310245 -0.0127147 -0.0367606 0.0294632 -0.0668417 -0.0922826 0.1653541 0.0177226 0.0925668 -0.0294791 0.0135307 0.0702668 0.0336715 0.0497726 -0.0855402 -0.1311957 0.0305682 -0.0749505 -0.0048805 0.0320168 -0.0570464 0.0324936 -0.0285157 -0.0408099 0.1206211 0.028677 0.0808854 -0.0173848 0.055379 0.0163734 0.0235166 0.079284 -0.0885031 -0.1135599 0.0741153 -0.1091459 0.0230517 0.0521964 -0.0106778 0.0218446 -0.0698759 -0.0819188 0.1320107 0.0769421 0.1255984 -0.0079318 -0.0895277 -0.0084096 -0.1129159 -0.0125284 0.099633 -0.0109266 -0.1571727 -0.0102292 -0.0813493 0.0592519 0.0556644 0.0288655 0.0716994 -0.0342721 -0.024301 0.0333401 -0.0246528 0.1715501 0.0436352 -0.0570783 0.0292497 -0.0893735 -0.1123119 0.0074092 0.0319705 0.0045314 0.1765836 -0.1121207 0.0035086 0.0644273 -0.0018162 0.0907572 -0.0026136 0.0658323 -0.0047181 0.1404064 0.1472904 0.0767464 0.0618331 0.0583058 0.3541939 -0.0415284 0.0769152 -0.0244348 0.3120419 0.1291002 -0.181164 0.0376265 -0.1029917 0.3090297 0.0230228 0.0550673 0.0386817 0.3620164 unknown
polarizability: 130.8314275|2.9063787|114.9545612|-10.1667951|1.8252825|61.2772787 unknown
InChI: InChI=1S/C9H12O2/c1-2-4-7-8(10)5-3-6-9(7)11/h3,5-6,10-11H,2,4H2,1H3
charge 0 multiplicity 1
23 atoms
O  -0.012085 2.438504 -0.148615
O  0.027419 -2.426743 -0.357829
C  1.530774 -0.046097 -0.618799
C  0.049853 -0.025376 -0.280598
C  2.442633 0.041084 0.639953
C  -0.653157 1.188928 -0.052125
C  -0.689023 -1.228219 -0.141468
C  3.942521 0.041653 0.278563
C  -2.025783 1.215579 0.286442
C  -2.062229 -1.234342 0.197337
C  -2.722092 -0.002425 0.408489
H  1.763527 -0.982235 -1.155054
H  1.793579 0.778088 -1.319594
H  2.194129 0.948131 1.227178
H  2.212832 -0.822231 1.292156
H  4.216419 -0.877822 -0.271853
H  4.202757 0.905771 -0.362808
H  4.573426 0.093137 1.184529
H  -2.514465 2.18012 0.447041
H  -2.607774 -2.181273 0.296093
H  -3.784973 0.00486 0.672052
H  0.934936 2.324473 -0.412577
H  -0.572927 -3.206666 -0.263213
