program: Gaussian 09
title: 000262056
version: EM64L-G09RevD.01
frameworkgroup: C1[X(C9H11N3OS)]
method: RPBEPBE
basis: SDD
operation: Freq
keyword: #p
keyword: freq=noraman
keyword: PBEPBE/SDD
title: #p freq=noraman PBEPBE/SDD
converged: YES YES NO NO
title: Mulliken charges:
elementType: S O N N N C C C C C C C C C H H H H H H H H H H H
charge: 0.319027 -0.246268 0.036737 -0.395698 -0.653737 -0.212414 -0.562807 0.457524 0.204929 -0.550262 -0.709981 -0.283915 -0.513356 0.292625 0.221034 0.232813 0.238196 0.214906 0.246100 0.224495 0.254466 0.261329 0.281414 0.344762 0.298082
chargesum: 0.00000
title: Mulliken charges with hydrogens summed into heavy atoms:
elementType: S O N N N C C C C C C C C C
charge: 0.319027 -0.246268 0.036737 -0.114283 -0.010893 0.008619 -0.091798 0.457524 0.204929 -0.550262 -0.024480 -0.029449 -0.252027 0.292625
polarizability: 2.39624369e+02 -1.24224661e+00 1.45746312e+02 -8.84536438e-01 -9.55650172e+00 7.12331682e+01
1716.lowfreq: -0.0025 -0.0014 -0.0012 1.7233 5.9106 9.2285 27.3512 62.7130 67.0331
frequency: 27.3355 62.6578 67.0168 81.4789 141.5438 193.9446 201.4295 213.3876 230.5488 246.3300 280.6735 350.2224 360.6731 415.2365 465.3503 483.5283 500.1992 520.8232 529.4750 567.5204 585.3091 602.8558 656.8572 683.4302 706.9208 717.1564 731.1076 781.9698 840.2211 878.7378 902.8804 918.9997 947.4330 987.0289 1040.1422 1043.4942 1069.5062 1090.0286 1097.6829 1113.9860 1185.1909 1205.5097 1231.1631 1284.3355 1288.9427 1292.3591 1342.4976 1385.7960 1394.6025 1459.6331 1466.8969 1472.9342 1481.4978 1496.2602 1535.4485 1601.6218 1604.9422 1682.6695 2966.2263 2981.3002 2988.4072 3036.7268 3075.3866 3084.3641 3174.0440 3232.4521 3412.5968 3538.0139 3696.2362
redmass: 4.4006 4.3966 4.5161 4.1790 5.0194 3.0288 2.1928 4.9973 1.2668 2.2957 2.8559 3.4466 2.4936 4.4365 2.2323 1.4530 4.4882 1.5959 3.0557 4.0188 5.6064 4.5264 4.5198 3.8074 6.2937 1.5707 5.9671 4.8475 2.9588 1.3437 2.3173 1.6376 2.7320 3.0462 2.3263 2.2202 2.0494 1.5047 1.4388 3.5012 1.3094 1.3910 1.6598 1.4478 2.4860 1.4564 4.8489 4.9459 1.1979 1.2766 3.4553 1.0532 1.1012 1.8609 5.4252 2.6665 1.8641 5.4070 1.0811 1.0359 1.0633 1.1021 1.0997 1.1004 1.0922 1.0992 1.0751 1.0459 1.1034
irintensity: 17.2645 1.9937 2.2638 4.0765 0.2213 2.2094 1.1116 1.7336 0.9546 3.1734 16.4024 34.9646 7.2939 5.2271 114.1271 172.8419 12.7589 72.2809 19.4105 10.5057 1.5877 4.2571 15.5839 14.2653 5.0206 64.3559 8.9502 14.4430 7.5163 1.6001 5.0613 5.7985 15.8137 3.5923 40.6077 0.5752 5.0739 4.4999 14.8259 204.3862 1.9290 5.1066 2.2844 7.5582 493.6555 49.4812 5.3220 2.3063 17.2256 2.2895 48.8659 6.2446 20.6747 416.2212 32.5694 64.7927 89.1195 312.2690 18.8355 25.2769 52.4369 20.4521 26.0905 24.7225 8.8945 0.1732 9.3018 56.8284 45.7912
temp: 298.150 k
press: 1.00000 atm
elementType: 16 8 7 7 7 6 6 6 6 6 6 6 6 6 1 1 1 1 1 1 1 1 1 1 1
symmnumber: 1
zpe: 502031.9 jmol-1
zpe.correction: 0.191214 hartree
zpe.thermalcorrener: 0.205001 hartree
zpe.thermalcorrenthalpy: 0.205945 hartree
zpe.thermalcorrgfe: 0.149721 hartree
zpe.sumelectzpe: -986.039080 hartree
zpe.sumelectthermal: -986.025293 hartree
zpe.sumelectthermalent: -986.024349 hartree
zpe.sumelectthermalfe: -986.080573 hartree
dipole: 0.4724 7.1337 -1.3316
dipole: 7.2723
quadrupole: -68.5142 -90.4386 -92.1236
quadrupole: -16.5068 4.0140 -1.3801
quadrupole: 15.1779 -6.7465 -8.4314 -16.5068 4.0140 -1.3801
hfenergy: -986.2302942 hartree
pointgroup: C01 [X(C9H11N3O1S1)]
dipole: -0.314484 -2.7830533 -0.5846805 debye
dipolederiv: -0.0001593 -0.090027 -0.033289 -0.0443319 -0.184825 -0.0619381 -0.0017007 -0.0735577 0.1505154 -0.8001926 -0.1234079 0.0118315 -0.5080428 -1.0318086 -0.1197368 -0.059414 -0.1504471 -0.3965567 0.8843239 0.0358731 -0.0522355 -0.8071443 -0.3347295 0.0302972 -0.1626493 -0.0591251 -0.0876617 -2.1855466 -0.3553278 0.0536329 -0.0179079 -0.1860796 0.0234696 0.0712505 0.0790686 -0.3405995 -1.4595711 0.3259994 0.1346081 0.5412254 -0.5179487 0.0542416 0.1734136 0.0726688 -0.771669 0.0304839 0.0093629 -0.0417604 -0.0559911 -0.0941392 0.0090251 -0.0015706 0.0439152 0.1987028 -0.0068665 0.0268445 -0.0253301 0.0474025 0.0720965 -0.003087 -0.050909 -0.0561174 0.1662126 -0.0514881 -0.1574513 -0.0383859 -0.0031349 0.0697961 0.0118059 0.0312712 0.0729845 -0.0477061 0.311292 -0.0380678 -0.0141153 -0.1064979 0.3464766 -0.0085797 -0.0331114 0.057207 -0.0279666 -0.1809224 -0.1290251 -0.0144261 -0.1048242 0.2538027 0.103346 -0.0553108 0.0865014 -0.1647921 0.0370639 0.0157765 -0.0119566 0.0181762 0.0377604 0.032443 -0.0228536 -0.0238788 -0.0105094 0.1132425 0.059402 0.0174759 0.0818958 -0.2672333 -0.0203652 0.029194 -0.0332782 -0.1474983 -0.1865172 0.2930971 0.0695494 0.255257 0.0848917 0.0975486 0.0500971 0.0929826 -0.2971477 3.0040226 0.1110407 -0.1971827 0.806507 1.5084913 0.2214089 -0.0780531 0.2605054 0.4055615 -0.0226997 0.068167 0.1066553 0.0391156 -0.0074338 -0.0332684 0.0805436 -0.0468067 -0.0827097 0.0508111 -0.0348751 0.0400636 -0.0666454 -0.1083328 0.0574284 0.0611575 0.1193219 0.028987 0.0497596 0.0344022 -0.0300394 -0.0199855 0.0041703 -0.0572462 -0.0753609 -0.1129835 -0.1166604 -0.1292861 0.0012304 -0.0812675 -0.0572258 0.0918181 -0.0105674 -0.0318917 0.0038777 0.0606191 0.0108543 0.0093164 0.1134127 0.0487766 0.0727579 -0.0566633 0.0565575 -0.0240474 -0.0275879 0.0890496 -0.0400835 -0.0102506 -0.014245 -0.1874105 0.0088236 -0.010577 -0.0164433 0.0614324 -0.0329266 -0.0526224 -0.0168465 -0.1103034 0.0593808 -0.0320269 -0.0294915 -0.0278468 0.1820795 0.0100663 0.0533763 0.0048989 0.0382412 0.0588928 -0.0318859 0.0009819 -0.0312477 0.2087864 -0.013864 0.0150844 0.0036559 0.0693303 -0.020482 -0.0690739 0.037911 -0.0840283 0.2977905 0.2539996 -0.0107159 0.010574 0.0146529 0.1844113 -0.059121 0.0142334 -0.0570568 0.3855941 0.2250709 -0.0273692 0.0007272 -0.0443003 0.0956763 -0.0862782 0.006282 -0.0921683 0.3727837 unknown
polarizability: 239.322209|-4.804622|145.4918154|-2.9920037|11.4554511|71.7898252 unknown
InChI: InChI=1S/C9H11N3OS/c1-5-4-6-2-3-14-8(6)7(5)11-12-9(10)13/h2-3,5,12H,4,10H2,1H3
charge 0 multiplicity 1
25 atoms
S  -1.960596 2.074479 0.368697
O  3.617297 1.814713 0.17554
N  1.100568 0.552839 -0.008664
N  2.299652 -0.124246 -0.16648
N  4.628518 -0.214309 -0.377099
C  -0.223866 -1.684707 -0.217161
C  -1.764974 -1.857645 -0.500926
C  -2.351801 -0.494129 -0.184256
C  -0.013838 -0.152929 -0.058835
C  -1.334665 0.431231 0.042996
C  0.195968 -2.439245 1.075379
C  -3.668536 0.07169 -0.103586
C  -3.640386 1.432038 0.187185
C  3.519375 0.594782 -0.104081
H  0.363966 -2.073538 -1.074833
H  -2.192188 -2.664401 0.123502
H  -1.948759 -2.134105 -1.557165
H  1.244563 -2.240055 1.36321
H  -0.440669 -2.12081 1.920124
H  0.075816 -3.530107 0.943844
H  -4.597373 -0.484487 -0.250916
H  -4.475502 2.119766 0.312542
H  2.315945 -1.13327 -0.363608
H  5.538213 0.236702 -0.325905
H  4.577271 -1.187757 -0.670203
