program: Gaussian 09
title: 000262068
version: EM64L-G09RevD.01
frameworkgroup: C1[X(C16H18O3S)]
method: RPBEPBE
basis: SDD
operation: Freq
keyword: #p
keyword: freq=noraman
keyword: PBEPBE/SDD
title: #p freq=noraman PBEPBE/SDD
converged: YES YES NO NO
title: Mulliken charges:
elementType: S O O O C C C C C C C C C C C C C C C C H H H H H H H H H H H H H H H H H H
charge: 0.945985 -0.386296 -0.502868 -0.507196 -0.520122 0.392720 0.153955 -0.366491 -0.394345 -0.454446 0.475225 -0.426363 -0.690812 -0.036503 -0.803061 -0.249292 -0.241996 -0.198829 -0.199561 -0.215015 0.199007 0.236473 0.235108 0.203564 0.239459 0.255117 0.231880 0.209571 0.211790 0.218544 0.231469 0.240034 0.221962 0.283254 0.281745 0.243574 0.243364 0.239399
chargesum: 0.00000
title: Mulliken charges with hydrogens summed into heavy atoms:
elementType: S O O O C C C C C C C C C C C C C C C C
charge: 0.945985 -0.386296 -0.502868 -0.507196 -0.084641 0.392720 0.153955 0.072180 -0.154887 -0.199329 0.475225 -0.194484 -0.050906 -0.036503 -0.109596 0.033962 0.039749 0.044745 0.043802 0.024384
polarizability: 3.54325313e+02 8.98305638e+00 2.23814004e+02 -1.50581731e+00 1.81706533e+01 1.43935093e+02
1716.lowfreq: -23.0069 -11.2528 -1.4766 -0.0012 0.0018 0.0022 5.9565 9.5541 19.3045
frequency: -22.8382 3.2769 19.2368 30.6910 43.4692 55.2067 73.6092 82.5838 89.7130 140.7990 148.8723 157.1189 170.9521 188.6240 232.9274 243.6536 279.5097 287.3666 312.5048 314.2643 339.8188 361.5950 382.0807 402.8690 423.4700 452.6915 488.2699 496.6816 526.9330 563.8235 601.3404 604.1688 656.5234 686.4254 723.6874 730.7782 746.0942 758.7550 787.9505 815.4068 831.8907 848.0165 865.8225 888.2733 902.9012 931.7324 933.2628 938.1190 962.8799 976.3216 983.4247 1004.8521 1005.2051 1007.7465 1046.1070 1048.0475 1050.1951 1067.3790 1077.4014 1090.7687 1118.0168 1157.3621 1173.6904 1178.1870 1206.6386 1223.0116 1236.1615 1270.8525 1284.5456 1291.9383 1303.6408 1333.9366 1376.8235 1383.8402 1384.6404 1389.1964 1400.9839 1436.4200 1451.6432 1470.8994 1471.0072 1473.1811 1476.3336 1476.3784 1484.8544 1488.9496 1559.0345 1575.9103 1602.7388 1603.5847 2970.6453 2980.2929 2982.2206 2991.2177 3030.6832 3051.5928 3060.3969 3071.5300 3073.2010 3086.5497 3119.4290 3139.0829 3142.1811 3149.6102 3150.4460 3159.5730 3168.6155 3177.0662
redmass: 1.0347 5.2253 3.8705 4.8077 5.9084 4.0908 3.4448 6.0681 1.6330 7.6685 5.5058 7.4802 5.2577 3.4444 1.1450 8.5396 3.4305 2.6313 6.0342 4.0991 6.6468 4.4625 6.1608 2.8206 10.3984 3.4407 3.8938 4.3311 4.5148 5.1341 6.4798 4.2188 7.0005 2.4273 5.1878 3.6394 1.1360 1.4098 3.4717 14.3732 1.4154 1.2444 1.2718 1.8642 1.5318 15.1538 1.3469 2.9608 1.3817 6.3591 1.3892 1.3385 1.5734 4.2635 2.1140 2.9379 1.5524 1.4963 1.5463 2.1227 2.7695 1.4536 1.0553 1.1234 1.9675 1.4713 3.5290 1.2963 1.2412 1.3201 1.2990 1.4361 4.8261 3.7848 5.0412 1.2265 1.2634 2.2521 2.0221 1.1382 1.0470 1.2337 1.0612 1.0551 1.9972 1.1587 5.0778 5.8311 6.8528 6.5500 1.0355 1.0372 1.0600 1.0614 1.0977 1.1022 1.0978 1.0991 1.1024 1.0991 1.0873 1.0859 1.0958 1.0929 1.0887 1.0928 1.0970 1.1016
irintensity: 0.4964 1.6313 0.0921 1.3554 2.1579 1.3593 0.2831 3.1305 0.0803 1.6243 19.5695 1.3879 2.4000 2.3950 0.1291 10.5601 5.7266 0.7414 18.9514 2.8438 1.2602 7.3367 8.3283 0.0527 108.8148 21.3005 20.7079 63.9699 1.2336 0.9574 0.0064 10.7397 4.5011 29.8072 1.3553 1.4854 5.9883 66.7834 1.5681 63.8261 40.3473 0.2551 2.9754 0.1709 8.4252 63.7422 1.0141 2.4018 1.1492 8.2324 0.0069 0.5172 2.2589 2.0404 25.1035 0.5090 10.5773 2.8929 5.1643 25.6996 4.6938 12.3572 0.0098 15.4581 10.7777 2.2650 26.2617 3.2392 2.7451 0.5815 3.2873 3.6532 7.8292 1.4549 7.0590 12.6056 12.8319 14.8476 16.5976 1.1345 14.7330 9.1969 5.2962 4.5709 33.0680 23.3787 46.4254 5.4019 0.5365 3.6958 38.4920 37.8154 11.2707 42.3419 0.5384 0.1818 17.3263 45.7114 73.5192 18.2432 10.4035 0.8338 36.2570 6.1279 9.4281 1.9084 2.9912 33.1431
temp: 298.150 k
press: 1.00000 atm
elementType: 16 8 8 8 6 6 6 6 6 6 6 6 6 6 6 6 6 6 6 6 1 1 1 1 1 1 1 1 1 1 1 1 1 1 1 1 1 1
symmnumber: 1
zpe: 781597.1 jmol-1
zpe.correction: 0.297695 hartree
zpe.thermalcorrener: 0.318043 hartree
zpe.thermalcorrenthalpy: 0.318987 hartree
zpe.thermalcorrgfe: 0.244021 hartree
zpe.sumelectzpe: -1242.605500 hartree
zpe.sumelectthermal: -1242.585152 hartree
zpe.sumelectthermalent: -1242.584208 hartree
zpe.sumelectthermalfe: -1242.659173 hartree
dipole: 1.3520 0.8347 -3.6080
dipole: 3.9424
quadrupole: -91.7508 -119.6076 -136.3841
quadrupole: 2.6597 -7.3939 8.3098
quadrupole: 24.1634 -3.6935 -20.4699 2.6597 -7.3939 8.3098
hfenergy: -1242.9031949 hartree
pointgroup: C01 [X(C16H18O3S1)]
dipole: 0.542129 0.4413973 -1.3845804 debye
polarizability: 353.631313|12.7756067|221.6354365|1.904955|23.6555119|146.8076608 unknown
InChI: InChI=1S/C16H18O3S/c1-3-7-14-11-10-13(2)12-16(14)19-20(17,18)15-8-5-4-6-9-15/h4-6,8-12H,3,7H2,1-2H3
charge 0 multiplicity 1
38 atoms
S  0.973728 -0.729181 1.136811
O  -0.187539 0.003997 -0.37924
O  0.727636 -2.33514 1.251752
O  0.863729 0.216623 2.459685
C  -1.713565 2.237161 0.669945
C  -2.351309 0.9268 0.25267
C  -1.553051 -0.164467 -0.231944
C  -1.282971 3.109279 -0.544976
C  -3.749393 0.730104 0.27785
C  -2.140843 -1.401574 -0.616058
C  -3.539743 -1.586312 -0.567879
C  -4.334594 -0.496452 -0.11998
C  -0.63281 4.436312 -0.101805
C  2.618417 -0.408133 0.286101
C  -4.168791 -2.907848 -0.973599
C  3.270333 0.805286 0.55849
C  3.11922 -1.399075 -0.573614
C  4.513042 1.032709 -0.076657
C  4.363122 -1.150124 -1.198183
C  5.052571 0.061147 -0.952616
H  -2.426739 2.812279 1.291651
H  -0.82145 2.038951 1.293516
H  -0.573246 2.525913 -1.161157
H  -2.167152 3.315193 -1.180194
H  -4.393295 1.545679 0.627912
H  -1.475557 -2.205869 -0.94982
H  -5.424012 -0.613649 -0.072419
H  -1.331735 5.042611 0.505382
H  0.267927 4.248591 0.513019
H  -0.327904 5.043952 -0.973599
H  -3.897776 -3.182479 -2.009921
H  -3.824667 -3.729892 -0.318597
H  -5.26973 -2.866324 -0.912162
H  2.832688 1.530213 1.251897
H  2.568951 -2.331536 -0.732614
H  5.054671 1.964919 0.113494
H  4.788958 -1.899965 -1.872662
H  6.015179 0.246297 -1.441281
