program: Gaussian 09
title: 000262087
version: EM64L-G09RevD.01
frameworkgroup: C1[X(C21H20O5)]
method: RPBEPBE
basis: SDD
operation: Freq
keyword: #pfreq=noraman
keyword: PBEPBE/SDD
title: #p freq=noraman PBEPBE/SDD
converged: YES YES NO NO
title: Mulliken charges:
elementType: O O O O O C C C C C C C C C C C C C C C C C C C C C H H H H H H H H H H H H H H H H H H H H
charge: -0.271062 -0.286087 -0.285724 -0.225133 -0.225515 -0.235602 0.363270 -0.385629 -0.502010 0.376426 0.194276 0.343722 -0.694970 -0.412257 -0.567511 -0.383115 -0.389643 0.372510 -0.359516 -0.331894 -0.411395 0.338320 0.265399 0.267500 -0.758096 -0.757667 0.219524 0.228872 0.226159 0.250813 0.239601 0.206168 0.222605 0.237727 0.278180 0.238721 0.229609 0.302621 0.302577 0.255408 0.259529 0.250735 0.250233 0.259082 0.251385 0.251855
chargesum: 0.00000
title: Mulliken charges with hydrogens summed into heavy atoms:
elementType: O O O O O C C C C C C C C C C C C C C C C C C C C C
charge: -0.271062 -0.286087 -0.285724 -0.225133 -0.225515 -0.016078 0.363270 0.069402 -0.251197 0.376426 0.194276 0.343722 -0.026597 -0.174530 -0.289331 -0.144394 -0.160035 0.372510 -0.056895 -0.029317 -0.155986 0.338320 0.265399 0.267500 0.002401 0.004655
polarizability: 5.44306040e+02 -1.61239669e+01 2.23490069e+02 1.71357859e+00 -2.77327885e+01 1.39033391e+02
1716.lowfreq: -76.5548 -65.8971 -8.0079 -2.7349 -2.5936 -0.0006 0.0007 0.0012 18.7163
frequency: -76.5433 -65.8970 18.4431 21.6330 26.9067 40.6877 42.9384 47.6498 60.9418 86.2063 100.0246 117.5035 120.8748 160.7896 166.3052 176.5411 206.2520 225.0692 231.4745 253.3664 278.1418 292.4103 327.4948 338.0296 368.6843 378.0329 409.7064 411.1172 423.5841 455.7250 485.7079 501.3455 516.0050 523.9717 537.2829 562.8477 565.2432 579.7275 614.7346 622.2493 626.7357 641.8551 674.9490 719.9197 725.5721 733.3187 737.3990 749.2967 782.5604 823.6829 832.1717 843.6526 852.8690 868.0135 877.5786 884.6563 890.2723 895.9428 925.6900 959.0734 964.4072 968.0531 980.8342 994.8396 997.8092 999.1387 1008.8957 1044.6904 1044.9490 1050.5746 1082.5244 1097.3585 1115.9523 1121.7565 1146.5394 1151.4217 1167.9804 1173.1867 1199.8918 1208.4996 1218.7750 1245.6217 1250.4775 1277.4425 1299.0129 1305.1157 1313.4529 1336.1670 1350.6580 1372.6096 1383.8746 1384.9197 1387.8058 1391.6649 1416.6852 1425.6141 1453.5198 1453.7152 1454.2873 1457.4347 1457.5430 1473.0098 1482.2547 1485.1695 1493.1091 1558.9952 1569.1145 1607.2243 1620.6823 1629.0100 1649.4387 1650.6346 2981.9287 2987.0741 3008.4546 3008.4837 3034.3272 3054.9993 3076.1538 3092.9933 3094.9219 3095.1262 3126.7819 3133.0066 3142.9671 3143.9701 3144.6464 3146.6560 3171.3178 3182.9501 3209.7093 3218.5620
redmass: 1.0307 1.0468 5.3408 6.2285 6.2669 4.7322 4.0547 3.9741 4.2778 4.7640 2.4281 3.5838 3.9803 6.5236 3.5672 4.8797 1.6078 4.2762 3.0808 6.5481 4.3086 4.9383 5.4148 5.5839 4.1286 4.3745 3.5663 3.4977 4.5242 3.1235 4.4577 3.7777 4.2811 3.4118 4.4642 3.3911 3.3823 5.3582 4.3621 5.4274 5.0161 5.6713 6.6255 5.4530 3.4863 3.2762 3.6657 3.4529 2.7218 1.3465 1.3239 3.0132 1.9565 2.1954 1.6045 6.9728 2.6399 1.8113 3.2481 1.3905 1.3642 3.0816 1.3470 3.1045 1.9652 1.8937 2.2694 1.6005 1.6004 2.5642 1.9860 2.1345 2.1028 1.3569 1.6600 2.3360 3.6180 3.6868 2.8713 1.5244 1.6521 1.3106 1.7812 1.2288 2.5836 1.4630 1.7548 1.3845 2.0835 3.0580 1.2252 1.2207 1.2117 4.9033 3.7379 3.9753 1.0623 1.0622 1.0777 1.0456 1.0457 1.0556 2.7853 1.0584 2.7734 8.4762 6.8954 6.3663 7.3039 7.3422 11.0310 10.9825 1.0371 1.0600 1.0368 1.0367 1.0961 1.0900 1.0990 1.0999 1.0972 1.0972 1.0917 1.0911 1.0903 1.1010 1.1009 1.0874 1.0963 1.0927 1.0943 1.0941
irintensity: 0.9262 1.2188 0.0608 0.8994 3.6593 0.9715 2.0667 0.8772 0.1503 2.1883 1.3128 1.7297 2.1519 1.9729 1.2097 2.8489 0.0840 0.3791 1.6823 3.8774 1.2959 1.0759 1.9426 2.0999 0.3871 2.0942 0.2376 0.0715 2.3350 4.6449 9.7910 6.3047 11.6598 11.5699 3.4778 4.2395 0.3207 6.1578 2.3388 15.1611 3.3246 36.8202 1.9257 5.9213 0.5190 5.6766 4.8923 5.8653 15.9677 1.0148 22.8945 20.4050 73.8249 4.1714 25.4551 80.1990 41.1834 9.2417 32.2487 7.1259 7.2812 94.8228 2.6464 6.2934 116.9433 80.4960 56.6065 9.3298 10.2374 8.2045 3.2245 204.6961 27.7495 22.4216 14.8235 476.7172 1297.2611 100.1382 22.4069 59.3355 30.6659 1.1846 29.3247 4.7609 15.6122 10.7668 2.3771 2.1667 0.2027 6.0533 45.9827 71.0256 19.6798 82.3544 5.7484 26.5701 11.2056 18.6222 6.9249 16.2424 18.8523 6.3169 17.7888 12.3049 202.4537 48.8309 3.7608 8.9844 70.2561 5.2462 138.8551 367.1037 40.9139 10.5783 6.3614 4.0091 2.8431 19.1488 48.9861 29.6614 5.7535 6.1402 15.5592 13.3156 8.6828 7.6319 7.4868 10.8396 7.6187 0.7123 2.9066 3.7679
temp: 298.150 k
press: 1.00000 atm
elementType: 8 8 8 8 8 6 6 6 6 6 6 6 6 6 6 6 6 6 6 6 6 6 6 6 6 6 1 1 1 1 1 1 1 1 1 1 1 1 1 1 1 1 1 1 1 1
symmnumber: 1
zpe: 937694.2 jmol-1
zpe.correction: 0.357149 hartree
zpe.thermalcorrener: 0.380636 hartree
zpe.thermalcorrenthalpy: 0.381580 hartree
zpe.thermalcorrgfe: 0.300755 hartree
zpe.sumelectzpe: -1186.495427 hartree
zpe.sumelectthermal: -1186.471940 hartree
zpe.sumelectthermalent: -1186.470996 hartree
zpe.sumelectthermalfe: -1186.551821 hartree
dipole: -1.6749 2.7330 -0.3946
dipole: 3.2296
quadrupole: -120.5297 -153.6232 -154.3485
quadrupole: 1.6144 4.1564 1.4080
quadrupole: 22.3041 -10.7894 -11.5147 1.6144 4.1564 1.4080
hfenergy: -1186.8525756 hartree
pointgroup: C01 [X(C21H20O5)]
dipole: 0.6747652 0.8107076 0.7084527 debye
polarizability: 544.6860741|6.4800376|173.4536932|10.0238484|49.7662387|188.6897325 unknown
InChI: InChI=1S/C21H20O5/c1-4-20-19(15-5-8-17(9-6-15)24-13(2)22)11-16-7-10-18(25-14(3)23)12-21(16)26-20/h5-12,20H,4H2,1-3H3
charge 0 multiplicity 1
46 atoms
O  -1.465212 0.976116 1.399039
O  -5.929064 -0.125779 0.150043
O  6.271801 -0.389215 0.215623
O  -6.907318 -1.474702 -1.520125
O  6.79011 -1.371083 -1.864855
C  -0.089896 1.299625 0.900865
C  0.541053 0.129983 0.143076
C  -0.134369 2.579424 0.028569
C  -0.296366 -0.695201 -0.56891
C  -1.747012 -0.548833 -0.507178
C  -2.30055 0.295612 0.504344
C  2.017303 -0.001326 0.12784
C  -0.654561 3.813121 0.792575
C  -2.646055 -1.267929 -1.333639
C  -3.688132 0.396662 0.692696
C  2.692269 -0.553173 -0.999166
C  2.821262 0.412061 1.230979
C  -4.548051 -0.335011 -0.15676
C  -4.045422 -1.171768 -1.185065
C  4.091172 -0.71453 -1.039115
C  4.219081 0.260783 1.21258
C  4.85166 -0.303311 0.082864
C  -7.014687 -0.7038 -0.544302
C  7.148867 -0.917933 -0.758548
C  -8.314599 -0.245206 0.080694
C  8.57213 -0.845538 -0.250588
H  0.447549 1.519105 1.838811
H  -0.764174 2.37691 -0.859612
H  0.891058 2.764369 -0.347435
H  0.107579 -1.527204 -1.157693
H  -1.658067 3.620993 1.210089
H  0.01662 4.076142 1.632079
H  -0.719865 4.690838 0.12491
H  -2.239169 -1.925041 -2.111316
H  -4.098781 1.029709 1.482759
H  2.112653 -0.839356 -1.883427
H  2.35598 0.826894 2.130785
H  -4.722376 -1.727087 -1.832777
H  4.580602 -1.1344 -1.917905
H  4.833034 0.566172 2.065046
H  -8.138565 0.432955 0.92696
H  -8.88442 -1.127308 0.421395
H  -8.926218 0.262854 -0.685175
H  8.621185 -0.396755 0.751002
H  9.180106 -0.253055 -0.956301
H  9.000455 -1.86278 -0.225233
