program: Gaussian 09
title: 000262066
version: EM64L-G09RevD.01
frameworkgroup: C1[X(C16H15NO3S)]
method: RPBEPBE
basis: SDD
operation: Freq
keyword: #p
keyword: freq=noraman
keyword: PBEPBE/SDD
title: #p freq=noraman PBEPBE/SDD
converged: YES YES NO NO
title: Mulliken charges:
elementType: S O O O N C C C C C C C C C C C C C C C C H H H H H H H H H H H H H H H
charge: 0.949185 -0.390937 -0.487337 -0.496293 -0.016803 -0.521707 0.395222 -0.365596 0.170282 -0.382073 -0.459007 -0.687981 -0.024751 -0.381546 0.424190 -0.249276 -0.242644 -0.196358 -0.196850 -0.211825 -0.255247 0.203933 0.244447 0.235631 0.206017 0.248751 0.275851 0.211125 0.214597 0.221656 0.258650 0.285239 0.283769 0.246881 0.247737 0.243070
chargesum: 0.00000
title: Mulliken charges with hydrogens summed into heavy atoms:
elementType: S O O O N C C C C C C C C C C C C C C C C
charge: 0.949185 -0.390937 -0.487337 -0.496293 -0.016803 -0.073327 0.395222 0.076052 0.170282 -0.133322 -0.183156 -0.040604 -0.024751 -0.122896 0.424190 0.035964 0.041124 0.050523 0.050887 0.031245 -0.255247
polarizability: 3.50382965e+02 2.00454296e+01 2.46771946e+02 -4.13145335e+00 1.95199525e+01 1.37193332e+02
1716.lowfreq: -5.9474 -0.0021 -0.0017 -0.0011 3.9384 6.5562 12.2687 24.3916 31.7580
frequency: 11.5928 24.3388 31.7298 42.8853 45.8001 62.5822 83.8598 87.2780 130.0694 143.2476 149.1386 156.3932 173.2062 180.4146 228.3371 244.6609 277.3590 283.9666 306.9863 332.1291 346.3907 384.7115 403.3937 419.0386 431.5016 436.8024 482.5013 492.1217 506.9912 552.7421 586.8849 600.7174 646.6773 657.8974 685.1137 699.3864 729.9412 746.2037 759.5237 787.9019 821.3708 847.0875 847.2589 868.7554 890.9575 914.1414 934.7232 940.4347 944.3121 974.2935 975.3297 984.6106 1006.7034 1007.0209 1046.2208 1047.5416 1066.0507 1079.5186 1088.6746 1111.3318 1157.3503 1175.4578 1179.9527 1207.3016 1220.7353 1225.0786 1272.3244 1285.4530 1292.0384 1305.8675 1335.6557 1369.0320 1384.7144 1385.8500 1389.0379 1437.8298 1451.9455 1471.7008 1474.5148 1474.9627 1478.2716 1489.0856 1543.3915 1574.3022 1596.3287 1602.8233 2180.6176 2973.4229 2984.1268 2995.0425 3033.4146 3055.9135 3074.4013 3075.9712 3136.6087 3142.4439 3153.3477 3161.7284 3166.4513 3170.8056 3178.2093 3179.3804
redmass: 6.0321 4.1678 4.7949 6.0616 6.0527 4.8827 5.2578 1.6832 9.7942 7.7489 5.8108 5.0982 5.5929 6.7024 1.1388 8.6743 3.4447 6.9192 3.5197 6.5267 6.5892 6.7973 2.8259 9.8555 4.4733 6.8446 5.8347 4.7729 4.7332 6.4715 6.1201 6.4856 4.6980 6.7212 2.4774 6.2051 3.9482 1.1075 1.3955 3.6491 16.6282 1.2527 1.4633 1.2993 1.8878 1.6466 1.3405 4.8557 11.7614 1.4009 6.0634 1.3897 1.4221 3.6812 2.0958 3.0134 1.6131 1.5510 2.1054 2.5180 1.5083 1.0552 1.1224 1.7964 3.3100 1.8075 1.2801 1.2841 1.2770 1.2957 1.4071 4.0623 7.3965 4.2188 1.2308 2.2586 2.0127 1.2072 1.5270 1.0780 1.3485 1.0955 6.0727 5.8102 6.4238 6.9100 12.6313 1.0356 1.0603 1.0609 1.0984 1.1026 1.0991 1.1024 1.0891 1.0862 1.0887 1.0929 1.0962 1.0972 1.0936 1.1016
irintensity: 1.5019 0.0707 1.0586 1.8689 0.1844 1.2567 1.1317 0.5680 1.4872 1.7367 4.3311 7.2167 7.4616 1.9820 0.1539 10.9239 1.5903 4.4973 2.3427 7.9937 8.5368 16.6770 0.0997 58.8923 5.3483 47.9641 33.3668 61.3972 7.5813 2.9099 0.4189 0.0093 7.3912 5.1639 28.8335 1.8545 2.6026 5.6230 68.9425 2.7277 65.9100 1.6833 28.4215 4.7079 0.0871 24.2871 1.1297 26.6841 41.8999 0.3264 8.1392 0.0086 0.9888 0.5198 27.5457 0.3448 3.7737 4.8722 31.9409 2.9102 5.2232 0.0180 15.2552 5.4487 9.7464 1.6524 1.4763 3.7251 0.6425 3.5510 6.5728 5.2360 5.7623 1.1678 10.7367 15.6048 16.2045 3.6774 7.1574 12.5419 13.8937 20.6440 11.6745 3.9972 18.8539 0.3561 45.3444 37.2286 11.0551 37.2517 0.3544 0.2156 41.0356 70.7245 11.3338 1.0306 8.7201 1.0685 7.7330 1.9044 0.8134 27.8069
temp: 298.150 k
press: 1.00000 atm
elementType: 16 8 8 8 7 6 6 6 6 6 6 6 6 6 6 6 6 6 6 6 6 1 1 1 1 1 1 1 1 1 1 1 1 1 1 1
symmnumber: 1
zpe: 706943.0 jmol-1
zpe.correction: 0.269260 hartree
zpe.thermalcorrener: 0.290331 hartree
zpe.thermalcorrenthalpy: 0.291275 hartree
zpe.thermalcorrgfe: 0.215749 hartree
zpe.sumelectzpe: -1295.502439 hartree
zpe.sumelectthermal: -1295.481368 hartree
zpe.sumelectthermalent: -1295.480424 hartree
zpe.sumelectthermalfe: -1295.555950 hartree
dipole: 5.2911 4.3175 -2.7610
dipole: 7.3661
quadrupole: -111.5542 -137.2084 -140.7721
quadrupole: -24.8753 -13.1013 2.6672
quadrupole: 18.2907 -7.3635 -10.9271 -24.8753 -13.1013 2.6672
hfenergy: -1295.7716993 hartree
pointgroup: C01 [X(C16H15N1O3S1)]
dipole: 2.1819686 1.7266006 -0.8103285 debye
polarizability: 351.6621376|14.8021134|239.3442182|6.4469408|32.1427865|143.3418868 unknown
InChI: InChI=1S/C16H15NO3S/c1-2-6-14-10-9-13(12-17)11-16(14)20-21(18,19)15-7-4-3-5-8-15/h3-5,7-11H,2,6H2,1H3
charge 0 multiplicity 1
36 atoms
S  1.1764 -0.529501 1.17695
O  0.121485 0.273657 -0.354381
O  0.597639 -2.025215 1.435559
O  1.276154 0.544473 2.393261
N  -4.679071 -3.146027 -1.271312
C  -1.206694 2.642676 0.663734
C  -1.958472 1.392364 0.259183
C  -0.719214 3.464838 -0.566295
C  -1.258205 0.231119 -0.210957
C  -3.372755 1.331594 0.285225
C  -1.949462 -0.947926 -0.589776
C  0.0425 4.736906 -0.140971
C  2.817224 -0.613921 0.271332
C  -4.0756 0.173271 -0.104981
C  -3.364192 -0.98048 -0.543496
C  3.70042 0.467724 0.418434
C  3.083168 -1.759064 -0.496866
C  4.940575 0.386423 -0.25593
C  4.329664 -1.817122 -1.161361
C  5.249462 -0.747893 -1.043498
C  -4.080448 -2.165213 -0.939564
H  -1.859605 3.281411 1.288701
H  -0.32653 2.371683 1.276034
H  -0.066903 2.819866 -1.184477
H  -1.590075 3.73857 -1.194046
H  -3.93319 2.208082 0.629283
H  -1.375856 -1.819044 -0.918282
H  -0.598056 5.404478 0.465794
H  0.931417 4.482311 0.466218
H  0.385882 5.308449 -1.022505
H  -5.169134 0.148662 -0.066899
H  3.437604 1.324718 1.046177
H  2.357928 -2.576266 -0.558235
H  5.659706 1.206531 -0.164057
H  4.577817 -2.694287 -1.767238
H  6.212116 -0.80135 -1.562857
