program: Gaussian 09
title: 000026592
version: EM64L-G09RevD.01
frameworkgroup: C1[X(C13H9N3O2)]
method: RPBEPBE
basis: SDD
operation: Freq
keyword: #p
keyword: freq=noraman
keyword: PBEPBE/SDD
title: #p freq=noraman PBEPBE/SDD
converged: NO YES YES YES
title: Mulliken charges:
elementType: O O N N N C C C C C C C C C C C C C H H H H H H H H H
charge: -0.211103 -0.201935 -0.045830 -0.676987 0.021908 0.301313 0.282009 0.285415 -0.055199 -0.099430 -0.320317 -0.480836 -0.345894 0.405574 -0.440946 -0.308082 -0.273779 -0.229985 0.198567 0.319187 0.192303 0.285880 0.271493 0.232467 0.236921 0.328591 0.328694
chargesum: 0.00000
title: Mulliken charges with hydrogens summed into heavy atoms:
elementType: O O N N N C C C C C C C C C C C C C
charge: -0.211103 -0.201935 -0.045830 -0.019701 0.021908 0.301313 0.282009 0.285415 -0.055199 -0.099430 -0.121750 -0.161649 -0.153591 0.405574 -0.155066 -0.036588 -0.041312 0.006937
polarizability: 3.50065595e+02 -1.67347194e+01 1.92339133e+02 6.78829281e-03 -5.67385200e-03 6.37107805e+01
1716.lowfreq: -0.0009 -0.0007 0.0004 2.7261 5.3462 11.4064 49.4490 59.5712 81.0718
frequency: 49.4441 59.5055 81.0717 114.7884 142.3916 187.5795 261.5000 270.7532 286.6418 319.9323 339.4127 361.5938 409.2164 427.3237 461.0249 474.0551 492.0425 501.0414 519.9314 547.2174 571.2607 584.7246 618.6169 639.7399 673.1819 683.8175 707.2523 741.3205 759.7439 766.0871 786.2833 824.7477 826.9312 857.2011 868.1196 944.4556 950.5826 954.0417 966.8815 996.7603 1021.0762 1063.3932 1107.3871 1114.9439 1124.5408 1161.8878 1185.9907 1207.7142 1234.9078 1248.4163 1269.4274 1306.8196 1348.1500 1370.9351 1381.9763 1404.4585 1441.2062 1449.4080 1461.1208 1496.1157 1529.2364 1552.3401 1564.7040 1608.5541 1628.5286 1655.5467 3111.3862 3121.6789 3139.9151 3158.2588 3173.9323 3191.0433 3192.7155 3577.5644 3709.5185
redmass: 10.0557 6.7498 4.3460 3.8143 8.5905 4.7708 7.0117 5.0579 7.1568 5.8755 4.2453 1.1715 3.1447 6.5811 1.3036 5.7369 2.2799 7.6722 3.6228 6.4361 6.0766 4.8608 6.8812 4.2572 6.4867 6.8997 5.6044 3.3775 1.4706 10.6808 1.8873 2.4437 3.0933 5.2913 1.8725 5.1863 1.5109 1.3736 1.3296 1.3333 2.3004 2.3543 2.9510 1.6986 1.9748 1.2947 1.3855 6.1347 1.6056 3.1240 1.5104 5.0202 2.1794 8.8217 4.9921 5.3350 2.9286 2.9337 4.0516 4.0639 8.1247 6.3262 7.9395 6.5130 6.3803 1.2285 1.0871 1.0892 1.0883 1.0943 1.0995 1.0925 1.0945 1.0455 1.1028
irintensity: 0.2292 0.0190 0.0114 2.1581 0.8237 9.1441 1.3155 1.6343 2.5378 0.0562 3.5512 0.2892 2.3486 0.0312 212.1455 1.6671 0.0256 0.2652 3.9443 3.9389 2.2823 5.7457 0.6594 43.3115 10.2305 3.9834 25.9868 1.3043 103.7038 29.7106 5.2719 26.1421 4.8361 2.4264 1.6489 1.6571 26.3805 0.4343 1.3012 0.5285 11.4166 36.1052 15.7128 1.5933 3.7445 10.3786 24.1540 408.7431 5.9886 49.5126 9.8778 31.7167 9.8466 114.0625 33.3599 27.5104 20.3600 0.0565 26.5609 110.3805 39.8531 18.6682 46.2459 3.5129 16.3230 305.4184 13.5268 19.4624 11.1997 22.3065 24.8943 3.6943 8.5451 72.5688 24.4191
temp: 298.150 k
press: 1.00000 atm
elementType: 8 8 7 7 7 6 6 6 6 6 6 6 6 6 6 6 6 6 1 1 1 1 1 1 1 1 1
symmnumber: 1
zpe: 516445.9 jmol-1
zpe.correction: 0.196704 hartree
zpe.thermalcorrener: 0.210465 hartree
zpe.thermalcorrenthalpy: 0.211410 hartree
zpe.thermalcorrgfe: 0.155925 hartree
zpe.sumelectzpe: -814.196645 hartree
zpe.sumelectthermal: -814.182884 hartree
zpe.sumelectthermalent: -814.181940 hartree
zpe.sumelectthermalfe: -814.237424 hartree
dipole: 7.5112 5.8555 0.0012
dipole: 9.5239
quadrupole: -115.1582 -87.6631 -107.4986
quadrupole: -2.7144 -0.0098 -0.0040
quadrupole: -11.7182 15.7769 -4.0586 -2.7144 -0.0098 -0.0040
hfenergy: -814.3933491 hartree
pointgroup: C01 [X(C13H9N3O2)]
dipole: -2.9113676 -2.3588055 0.0004756 debye
polarizability: 350.6382835|-13.7620768|191.7664444|-0.0068936|0.0055454|63.7107805 unknown
InChI: InChI=1S/C13H9N3O2/c14-13-9-3-1-2-4-11(9)15-12-7-8(16(17)18)5-6-10(12)13/h1-7H,14H2
charge 0 multiplicity 1
27 atoms
O  5.170666 -0.221546 -0.000598
O  4.360661 1.910701 -0.000656
N  -0.608816 1.402856 0.000121
N  -1.43028 -2.806606 -0.000321
N  4.197055 0.630452 0.00029
C  0.189814 -0.967033 -0.000024
C  -2.2381 -0.490893 -0.000071
C  -1.164649 -1.451329 -0.00015
C  0.399669 0.47534 0.000099
C  -1.895027 0.925465 0.000049
C  1.338583 -1.830693 -0.000011
C  1.744117 0.979538 0.000194
C  -3.625225 -0.860807 -0.000105
C  2.814696 0.093016 0.000199
C  2.63396 -1.32761 0.000089
C  -2.958077 1.895477 0.000098
C  -4.629965 0.106066 -0.000053
C  -4.292112 1.5002 0.000042
H  1.220281 -2.92061 -0.000065
H  1.899018 2.060863 0.000281
H  -3.926372 -1.915694 -0.00015
H  3.512178 -1.976576 0.000108
H  -2.663614 2.949186 0.000183
H  -5.682161 -0.197468 -0.000075
H  -5.090038 2.250342 0.000079
H  -0.681165 -3.491507 -0.000409
H  -2.383396 -3.155731 -0.000442
