program: Gaussian 09
title: 000262054
version: EM64L-G09RevD.01
frameworkgroup: C1[X(C15H15NO)]
method: RPBEPBE
basis: SDD
operation: Freq
keyword: #p
keyword: freq=noraman
keyword: PBEPBE/SDD
title: #p freq=noraman PBEPBE/SDD
converged: YES YES NO NO
title: Mulliken charges:
elementType: O N C C C C C C C C C C C C C C C H H H H H H H H H H H H H H H
charge: -0.442052 -0.043248 -0.077444 -0.278998 -0.605989 0.310009 0.282366 -0.569001 -0.416862 -0.432333 0.206299 -0.232568 -0.228279 -0.331354 -0.186173 -0.370701 -0.185594 0.265231 0.197007 0.232404 0.243823 0.190663 0.233790 0.260158 0.241796 0.339902 0.224553 0.222910 0.241415 0.237101 0.239513 0.231658
chargesum: 0.00000
title: Mulliken charges with hydrogens summed into heavy atoms:
elementType: O N C C C C C C C C C C C C C C C
charge: -0.102150 -0.043248 0.187787 -0.081992 -0.129762 0.310009 0.282366 -0.144547 -0.156704 -0.190537 0.206299 -0.008015 -0.005369 -0.089939 0.050928 -0.131188 0.046064
polarizability: 2.16411888e+02 -1.19370152e+01 1.60505267e+02 3.95229385e+00 4.06231729e+00 1.10064880e+02
1716.lowfreq: -8.2222 -0.0009 -0.0008 -0.0007 3.3984 11.3272 24.7067 35.2146 44.4973
frequency: 24.1984 35.1012 44.3998 77.1074 129.2526 158.7124 192.9567 212.2772 230.1376 257.6259 308.2335 363.0717 397.2801 406.5550 445.4272 470.5927 487.4544 510.2864 531.4042 593.6723 605.7277 623.8643 633.9303 717.8207 749.0974 751.7818 774.8003 794.4021 822.5132 846.4466 854.2432 868.1180 892.3516 898.8061 947.7222 957.1076 960.3467 987.5678 994.2558 999.3890 1018.6517 1019.7702 1039.1529 1042.5840 1084.2997 1090.6963 1101.5341 1133.7400 1153.6024 1162.7958 1167.3586 1179.3924 1192.5176 1222.7654 1232.1502 1237.9714 1251.7775 1286.4263 1295.3888 1298.7590 1313.6348 1323.8652 1344.8078 1364.0526 1393.0551 1413.9072 1448.7146 1451.5088 1458.0578 1462.9238 1475.9506 1563.9207 1582.4463 1598.6263 1622.1994 2905.5545 2969.1782 2979.7244 2992.0626 3046.7441 3053.5572 3119.6724 3125.1896 3131.5040 3132.2964 3147.4068 3148.4714 3162.3230 3168.9283 3562.5447
redmass: 4.4177 4.6968 4.1814 4.1646 3.9795 4.9804 4.0944 4.1000 1.1161 3.7917 3.6667 2.0549 3.2680 3.4661 3.3988 3.7490 2.8167 4.7407 4.2465 4.8727 4.6829 5.0888 4.7673 3.5071 1.6698 1.4706 2.4853 2.4889 4.0742 2.7430 2.6102 1.5606 1.5273 1.3606 1.4413 1.4917 5.2311 1.3210 5.7553 1.3415 2.2397 2.2182 2.4617 2.8267 2.1845 2.0466 2.1426 1.2059 1.4372 1.0717 1.1241 1.2783 1.6436 1.4181 1.5977 2.1498 1.3465 1.4828 1.8619 1.5630 1.5321 2.5881 1.4319 1.6616 5.8753 1.9619 2.2855 1.2647 1.9327 1.2232 2.2805 5.7808 5.8355 7.0767 7.2692 1.0826 1.0625 1.0671 1.0818 1.0978 1.0977 1.0855 1.0874 1.0896 1.0900 1.0946 1.0948 1.0997 1.1014 1.0663
irintensity: 2.1702 0.7711 0.1934 1.1815 1.6408 3.6685 20.3257 5.8455 143.2837 2.3948 1.0180 2.4998 3.3035 5.4345 8.3089 1.3940 1.3700 1.3032 15.4103 0.9234 8.8414 2.3151 6.5246 0.9699 32.1722 71.9097 26.6001 21.0514 2.3692 10.8064 4.5308 4.4594 2.6442 0.5666 5.5102 0.4694 1.6943 0.3622 67.4172 0.1135 7.2766 6.9710 7.5996 11.3876 7.3379 4.8141 11.3114 1.3775 50.3422 1.3599 0.3926 24.3454 5.1440 0.4587 0.9006 1.9830 6.0733 5.5783 4.0879 3.1817 2.6109 2.3456 8.0360 8.0435 5.6795 16.6118 10.0880 5.6093 49.1566 20.3628 8.8266 14.2242 54.2105 1.3075 3.6673 45.5684 36.9835 14.4318 14.8008 7.5146 35.1763 1.1308 16.4537 3.4747 13.2634 27.5373 27.7065 30.2921 24.4202 5.1815
temp: 298.150 k
press: 1.00000 atm
elementType: 8 7 6 6 6 6 6 6 6 6 6 6 6 6 6 6 6 1 1 1 1 1 1 1 1 1 1 1 1 1 1 1
symmnumber: 1
zpe: 683248.3 jmol-1
zpe.correction: 0.260236 hartree
zpe.thermalcorrener: 0.274602 hartree
zpe.thermalcorrenthalpy: 0.275547 hartree
zpe.thermalcorrgfe: 0.217118 hartree
zpe.sumelectzpe: -709.354422 hartree
zpe.sumelectthermal: -709.340055 hartree
zpe.sumelectthermalent: -709.339111 hartree
zpe.sumelectthermalfe: -709.397539 hartree
dipole: 2.5089 0.4268 0.5593
dipole: 2.6057
quadrupole: -90.1636 -91.0316 -102.8517
quadrupole: 1.3751 8.5681 -3.7479
quadrupole: 4.5187 3.6507 -8.1694 1.3751 8.5681 -3.7479
hfenergy: -709.6146576 hartree
pointgroup: C01 [X(C15H15N1O1)]
dipole: -0.990755 0.1575326 -0.2109992 debye
polarizability: 216.0890936|12.6674793|161.0161136|3.6334345|-3.0510893|109.8768278 unknown
InChI: InChI=1S/C15H15NO/c17-15-12(10-13-6-3-4-8-16-13)9-11-5-1-2-7-14(11)15/h1-8,12,15,17H,9-10H2
charge 0 multiplicity 1
32 atoms
O  1.51955 2.728897 -0.250322
N  -2.941498 -0.609726 1.129443
C  0.012051 0.695555 0.034745
C  1.307741 1.458471 0.462572
C  0.374834 -0.815617 0.199278
C  2.415499 0.475512 0.131717
C  1.884152 -0.831105 -0.00672
C  -1.252393 1.148092 0.806611
C  3.793163 0.724256 -0.008755
C  2.740017 -1.915425 -0.285779
C  -2.509906 0.432595 0.348473
C  4.652581 -0.364483 -0.29606
C  4.129117 -1.674349 -0.43008
C  -3.184261 0.802933 -0.845557
C  -4.331528 0.08463 -1.245176
C  -4.052208 -1.296494 0.729491
C  -4.77943 -0.990566 -0.442484
H  -0.118027 0.905982 -1.046435
H  1.280809 1.651848 1.561478
H  -0.168757 -1.462709 -0.511607
H  0.104121 -1.165753 1.215995
H  -1.380629 2.242809 0.678319
H  -1.115602 0.942784 1.884438
H  4.18104 1.744253 0.080084
H  2.340534 -2.930094 -0.399108
H  0.930393 3.421847 0.14134
H  5.728092 -0.194596 -0.420686
H  4.805415 -2.507357 -0.654713
H  -2.811039 1.641797 -1.443538
H  -4.867264 0.357883 -2.16079
H  -4.362524 -2.120205 1.383276
H  -5.665442 -1.573565 -0.71305
