program: Gaussian 09
title: 000262053
version: EM64L-G09RevD.01
frameworkgroup: C1[X(C13H11N5O2)]
method: RPBEPBE
basis: SDD
operation: Freq
keyword: #p
keyword: freq=noraman
keyword: PBEPBE/SDD
title: #p freq=noraman PBEPBE/SDD
converged: YES YES NO NO
title: Mulliken charges:
elementType: O O N N N N N C C C C C C C C C C C C C H H H H H H H H H H H
charge: -0.269985 -0.180135 -0.446801 0.043407 0.040282 -0.034524 -0.618030 0.365481 -0.079100 -0.039352 -0.394397 -0.392179 0.006122 0.144563 0.367068 -0.333763 -0.369858 -0.228895 -0.198080 -0.255415 0.218692 0.242522 0.308826 0.249076 0.248946 0.248543 0.222605 0.225900 0.317590 0.364132 0.226759
chargesum: 0.00000
title: Mulliken charges with hydrogens summed into heavy atoms:
elementType: O O N N N N N C C C C C C C C C C C C C
charge: -0.269985 -0.180135 -0.137975 0.043407 0.040282 -0.034524 0.063692 0.365481 -0.079100 -0.039352 0.066817 -0.143103 0.006122 0.144563 0.367068 -0.084818 -0.121314 -0.006290 0.027821 -0.028657
polarizability: 2.98460136e+02 1.37828281e+01 1.53866498e+02 -1.44013187e+01 -9.05413798e+00 1.20588893e+02
1716.lowfreq: -4.3481 -0.0006 -0.0003 0.0004 1.8483 3.3975 17.0619 24.9604 29.5227
frequency: 17.0514 24.9356 29.5132 65.6657 92.2435 139.8398 144.6725 166.4288 199.1283 221.2913 230.7611 273.9383 323.3186 345.2780 370.7232 412.3045 435.6908 440.8274 443.2496 474.2782 501.8744 536.6872 546.4570 561.8491 581.3857 587.2057 600.2458 610.3713 671.5771 691.7288 696.3863 714.3385 745.2256 757.1375 800.1486 821.7896 827.8011 846.7628 879.4094 888.4465 910.2290 956.6646 959.3434 964.0475 980.8177 984.1918 986.6399 1022.5235 1023.6404 1083.5871 1138.7994 1166.3948 1167.8112 1178.9061 1203.2431 1213.6992 1251.8676 1277.0801 1297.3839 1314.0881 1324.5147 1366.5171 1377.1800 1390.7807 1436.3930 1437.8546 1445.7927 1458.9049 1479.6402 1527.5109 1533.9764 1592.0660 1598.3020 1602.4427 1610.9965 1648.0468 2988.2941 3063.9156 3105.1449 3127.5542 3136.4251 3155.5106 3164.5241 3173.0233 3512.5199 3547.6727 3699.0131
redmass: 5.9427 6.1204 4.8262 5.4364 5.5954 5.5169 7.6089 7.0658 7.0346 3.3825 5.2608 1.1455 3.7799 5.4555 3.8873 2.9471 5.0228 5.4211 6.5628 6.0163 2.8753 3.5725 1.4566 5.5052 1.5434 3.5601 5.3743 6.4102 6.5739 2.0328 9.0246 6.3466 8.7722 1.6588 7.4409 1.2670 6.6344 7.9795 5.3477 1.4720 1.5827 6.9301 1.5318 3.0009 1.3338 5.9071 1.9302 2.0678 2.3661 1.5217 4.8386 1.1717 1.9127 1.1985 2.1033 3.1322 3.7707 1.8100 2.1613 1.4127 2.2464 2.3396 2.2862 4.3547 3.6666 4.2003 2.6686 1.2737 2.1204 6.5880 4.7750 6.3910 3.3106 1.9946 6.2691 3.1132 1.0565 1.1068 1.0923 1.0847 1.0891 1.0927 1.0952 1.1003 1.0776 1.0457 1.1053
irintensity: 1.8812 6.6217 2.0511 0.3370 1.6797 2.0830 0.4908 1.6523 3.2325 7.1364 1.1839 49.3145 1.7598 1.2644 2.4464 0.1252 2.6138 0.3333 4.9579 4.8443 11.5607 90.7552 272.2768 5.1944 10.9671 2.4296 9.5944 1.0160 6.5117 32.8053 19.1800 4.7093 7.4191 88.7321 21.2773 0.4611 0.8091 29.7505 6.4062 7.2405 28.1650 33.3769 10.0334 37.6524 1.1558 2.5424 16.1791 29.7114 28.3989 13.6878 4.7708 25.4740 7.9635 54.9959 8.2659 312.8569 17.8046 1.8226 39.3562 21.0991 32.5786 1.9602 67.0766 70.9684 197.8481 150.6720 6.8087 80.0440 98.5914 77.9647 62.9715 37.2936 363.4243 215.2055 98.1523 440.6878 29.4902 11.0528 22.9875 3.6711 13.6723 40.0286 20.5071 5.5744 15.0999 149.3495 48.1635
temp: 298.150 k
press: 1.00000 atm
elementType: 8 8 7 7 7 7 7 6 6 6 6 6 6 6 6 6 6 6 6 6 1 1 1 1 1 1 1 1 1 1 1
symmnumber: 1
zpe: 599947.8 jmol-1
zpe.correction: 0.228508 hartree
zpe.thermalcorrener: 0.245147 hartree
zpe.thermalcorrenthalpy: 0.246091 hartree
zpe.thermalcorrgfe: 0.181643 hartree
zpe.sumelectzpe: -924.775191 hartree
zpe.sumelectthermal: -924.758552 hartree
zpe.sumelectthermalent: -924.757608 hartree
zpe.sumelectthermalfe: -924.822056 hartree
dipole: -5.3521 -7.9046 -0.4733
dipole: 9.5578
quadrupole: -68.2059 -126.5083 -109.7028
quadrupole: 36.8705 -6.5089 -5.5027
quadrupole: 33.2664 -25.0359 -8.2305 36.8705 -6.5089 -5.5027
hfenergy: -925.0036988 hartree
pointgroup: C01[X(C13H11N5O2)]
dipole: -2.1163206 -2.9744535 0.902102 debye
polarizability: 298.369124|7.1652449|144.0312684|-19.0885965|-17.5918357|130.5151347 unknown
InChI: InChI=1S/C13H11N5O2/c14-13-16-9-6-15-10(17-11(9)12(19)18-13)7-20-8-4-2-1-3-5-8/h1-6,16H,7,14H2
charge 0 multiplicity 1
31 atoms
O  2.113099 -0.199337 0.235159
O  -2.879843 2.620167 -0.936856
N  -3.980723 -1.092446 0.47005
N  -0.903308 0.532205 -0.754237
N  -0.424139 -1.811426 -0.306496
N  -4.500459 1.216972 -0.000301
N  -6.13414 -0.196391 0.877701
C  -2.651373 -0.930973 0.067341
C  -2.205328 0.345762 -0.388207
C  -0.064589 -0.536897 -0.687228
C  1.382822 -0.313012 -1.043495
C  -1.709853 -1.99554 0.071915
C  -3.192153 1.494271 -0.475231
C  -4.846944 0.012652 0.433207
C  3.508092 -0.030251 0.162231
C  4.243518 0.0715 -1.04467
C  4.170008 0.039201 1.413893
C  5.646983 0.241614 -0.985375
C  5.567392 0.209225 1.454484
C  6.316427 0.310771 0.255448
H  1.772956 -1.174949 -1.618592
H  1.478775 0.622359 -1.624117
H  -4.299455 -2.011346 0.786222
H  -1.99767 -3.009897 0.378918
H  3.74654 0.027436 -2.018254
H  3.574053 -0.040273 2.328257
H  6.214302 0.32207 -1.919615
H  6.074084 0.263394 2.424607
H  -6.470275 -1.078142 1.255798
H  -6.756329 0.608474 0.839951
H  7.402727 0.443509 0.291393
