program: Gaussian 09
title: 000262073
version: EM64L-G09RevD.01
frameworkgroup: C1[X(C14H15IN2O6)]
method: RPBEPBE
basis: SDD
operation: Freq
keyword: #p
keyword: freq=noraman
keyword: PBEPBE/SDD
title: #p freq=noraman PBEPBE/SDD
converged: YES YES NO NO
title: Mulliken charges:
elementType: I O O O O O O N N C C C C C C C C C C C C C C H H H H H H H H H H H H H H H
charge: 0.041750 -0.396298 -0.242709 -0.280373 -0.417863 -0.223981 -0.235160 -0.450274 -0.420421 -0.138134 -0.391829 -0.485724 0.117154 0.153596 0.301087 0.181240 -0.325161 -0.364873 0.501798 -0.467945 -0.350947 0.271825 -0.839997 0.311004 0.252575 0.285358 0.257090 0.268655 0.344431 0.215572 0.279873 0.230649 0.309079 0.299140 0.391078 0.379374 0.319738 0.319627
chargesum: 0.00000
title: Mulliken charges with hydrogens summed into heavy atoms:
elementType: I O O O O O O N N C C C C C C C C C C C C C C
charge: 0.041750 -0.005221 -0.242709 -0.280373 -0.038490 -0.223981 -0.235160 -0.105843 -0.121282 0.172870 0.146104 0.040020 0.117154 0.153596 0.301087 0.181240 -0.109590 -0.085000 0.501798 -0.237296 -0.041868 0.271825 -0.200632
polarizability: 3.28251749e+02 -1.98335160e+00 1.95400031e+02 2.44287839e+01 3.92630789e+01 1.45345962e+02
1716.lowfreq: -6.0780 -3.2897 -0.0007 -0.0003 -0.0002 3.2838 9.7036 16.1469 17.5647
frequency: 9.0714 16.0383 17.5459 26.1128 35.7680 38.3082 51.8184 66.8851 69.5658 74.3738 75.7923 94.6562 118.3945 136.3029 159.0674 194.4908 204.6264 227.2526 274.7172 303.7460 323.4501 334.1091 343.3309 402.5244 409.5285 425.9149 457.8162 498.3365 503.3074 511.5128 541.2449 559.9829 565.6324 582.2933 594.1472 611.0582 634.5907 635.7924 639.5970 676.2702 685.9776 718.4611 727.1864 763.2017 771.6903 802.4022 826.5231 836.0727 844.9402 876.0761 890.4919 899.0115 932.9763 939.8092 947.5367 1006.6934 1016.4245 1025.8716 1045.2379 1060.0649 1096.2274 1102.5562 1130.4717 1141.9122 1154.8669 1182.7090 1192.9831 1201.9256 1219.5769 1222.3636 1240.9945 1261.3728 1269.4769 1278.4177 1288.7446 1315.7916 1334.4383 1355.6417 1375.1592 1380.0021 1409.9630 1419.5174 1440.6989 1469.7331 1476.8058 1507.2266 1524.2762 1564.9504 1597.8601 1603.8234 1625.0305 1644.6614 1670.5578 2990.6709 3009.9325 3036.1871 3041.9188 3067.6298 3101.9290 3117.9605 3141.4079 3148.2605 3160.6305 3196.3985 3442.5643 3513.9784 3517.6411 3526.3160
redmass: 7.9904 8.2673 12.3531 5.5234 9.7821 5.7405 9.1143 3.8302 5.2246 8.1240 6.6212 2.8444 9.5641 4.8910 6.1115 5.9724 3.7378 7.5531 7.6869 4.9320 6.6569 6.6100 6.9490 4.0347 3.5637 4.8790 3.9566 3.2215 1.8304 4.9711 3.7198 2.6366 2.4632 1.8987 2.1619 5.4556 6.4521 1.6222 1.3664 5.9872 3.7994 1.1867 4.6749 2.8922 2.1810 3.3795 1.4920 1.7207 5.4228 4.0805 1.4827 4.3417 2.7843 5.9781 1.4605 2.9723 1.3584 2.7796 2.6959 2.1658 2.6175 2.4976 1.3746 1.1457 1.9212 1.5157 1.9332 1.1809 1.6279 1.4367 1.4218 1.7929 2.0112 1.6633 1.2430 1.3830 1.4967 2.5045 4.9380 1.8160 1.1487 3.6427 1.0974 1.1333 2.0001 2.1836 2.9130 5.9534 5.7308 5.5108 6.4660 8.4109 8.2857 1.0612 1.0816 1.0639 1.0956 1.0565 1.1037 1.0874 1.0966 1.1078 1.0908 1.0951 1.0769 1.0640 1.0643 1.0771
irintensity: 0.0150 0.2582 0.9499 1.2105 1.4071 3.8751 0.2393 2.9482 3.5375 4.0879 6.1439 0.7842 1.6207 0.1983 4.4239 9.3788 2.1180 13.1615 1.7885 1.9856 4.7953 19.3655 6.7663 1.2667 1.1423 25.9883 12.3140 20.4120 32.8731 4.8846 51.7632 33.0183 97.2414 39.3922 20.8093 90.8498 28.1248 98.5403 120.9211 18.0765 59.8458 22.0741 10.2882 29.1096 29.2522 23.8379 24.2766 43.5800 1.4340 12.8744 41.0588 21.9751 8.1792 1.2123 0.4205 3.0211 1.5489 125.7918 233.1359 155.3444 24.0960 68.5088 20.2324 0.0031 5.2562 5.2226 7.0278 38.3601 51.6772 16.5314 24.4689 65.3935 4.2916 15.4973 9.9105 47.3956 53.2846 221.7124 125.8038 101.4014 30.7902 5.4946 38.7429 42.8900 626.5926 312.7047 166.1002 305.6531 206.8106 74.6830 57.6912 143.0091 219.0199 9.4530 13.7542 8.7969 6.7572 0.9622 8.7385 20.1921 12.7018 0.2472 0.8570 2.1932 133.4983 23.5845 51.9918 44.1635
temp: 298.150 k
press: 1.00000 atm
elementType: 53 8 8 8 8 8 8 7 7 6 6 6 6 6 6 6 6 6 6 6 6 6 6 1 1 1 1 1 1 1 1 1 1 1 1 1 1 1
symmnumber: 1
zpe: 734362.3 jmol-1
zpe.correction: 0.279704 hartree
zpe.thermalcorrener: 0.303292 hartree
zpe.thermalcorrenthalpy: 0.304236 hartree
zpe.thermalcorrgfe: 0.218316 hartree
zpe.sumelectzpe: -1113.204170 hartree
zpe.sumelectthermal: -1113.180581 hartree
zpe.sumelectthermalent: -1113.179637 hartree
zpe.sumelectthermalfe: -1113.265557 hartree
dipole: 0.5700 4.5245 3.1066
dipole: 5.5178
quadrupole: -137.9880 -151.9217 -152.4074
quadrupole: -17.5316 -8.7649 -10.2947
quadrupole: 9.4510 -4.4827 -4.9684 -17.5316 -8.7649 -10.2947
hfenergy: -1113.4838734 hartree
pointgroup: C01 [X(C14H15I1N2O6)]
dipole: 0.1291778 0.2375174 -2.1539819 debye
polarizability: 321.7918381|17.2683842|126.8372104|31.5674621|-16.5978746|220.3686931 unknown
InChI: InChI=1S/C14H15IN2O6/c15-7-11(18)16-9-3-1-8(2-4-9)13(21)17-10(14(22)23)5-6-12(19)20/h1-4,10,16-17,19,22H,5-7H2
charge 0 multiplicity 1
38 atoms
I  -7.300937 0.047893 -2.647727
O  5.209819 2.162214 -0.793562
O  3.386571 1.808128 -2.187323
O  1.231219 0.832256 2.097244
O  4.6441 -3.538084 -0.728998
O  5.207997 -2.652999 1.342717
O  -5.698152 -0.466642 1.445235
N  1.842472 0.916356 -0.132741
N  -4.650677 0.118678 -0.582917
C  3.251257 1.160048 0.194899
C  4.001083 -0.10983 0.706444
C  3.990393 -1.262314 -0.3120
C  3.913487 1.735394 -1.051721
C  0.891736 0.803002 0.868958
C  -0.540705 0.634214 0.442269
C  4.673256 -2.505647 0.223191
C  -1.003868 0.816405 -0.888055
C  -1.481496 0.286275 1.444214
C  -3.292786 0.281269 -0.188512
C  -2.363111 0.643138 -1.200638
C  -2.844401 0.104713 1.148355
C  -5.73156 -0.227264 0.199339
C  -7.11124 -0.341761 -0.460389
H  3.306723 1.908417 1.009256
H  5.037354 0.173075 0.960013
H  3.507357 -0.420763 1.642117
H  4.49407 -0.988523 -1.26013
H  2.954108 -1.536104 -0.588453
H  1.596057 0.934329 -1.125449
H  -0.326492 1.116522 -1.695791
H  -1.112926 0.16505 2.467939
H  -2.707996 0.792995 -2.231341
H  -3.558009 -0.167428 1.927628
H  -4.854937 0.27779 -1.57699
H  5.620804 2.524132 -1.624962
H  5.094578 -4.342348 -0.352201
H  -7.797296 0.374508 0.016209
H  -7.492152 -1.364488 -0.319927
