program: Gaussian 09
title: 000262028
version: EM64L-G09RevD.01
frameworkgroup: C1[X(C3H10N3O2PS)]
method: RPBEPBE
basis: SDD
operation: Freq
keyword: #p
keyword: freq=noraman
keyword: PBEPBE/SDD
title: #p freq=noraman PBEPBE/SDD
converged: YES YES NO NO
title: Mulliken charges:
elementType: S P O O N N N C C C H H H H H H H H H H
charge: -0.279392 0.838031 -0.466705 -0.551231 -0.451885 -0.621300 -0.647100 0.316620 -0.476107 -0.459329 0.230559 0.231223 0.241327 0.240798 0.243866 0.223499 0.311810 0.350105 0.307079 0.418133
chargesum: 0.00000
title: Mulliken charges with hydrogens summed into heavy atoms:
elementType: S P O O N N N C C C
charge: -0.279392 0.838031 -0.466705 -0.551231 -0.451885 0.040615 0.078112 0.316620 0.227002 0.248834
polarizability: 1.34531504e+02 1.87021861e+00 9.73963966e+01 -9.16527496e+00 -3.14199106e+00 8.84516846e+01
1716.lowfreq: -13.2546 -10.0138 -0.0006 0.0018 0.0024 13.8173 26.2655 38.5979 69.4994
frequency: 25.8156 37.6797 69.4047 89.9014 106.1791 115.5174 146.3099 161.7699 199.6322 232.9001 251.3884 260.0981 320.0086 334.9544 387.8187 416.6920 455.0409 491.9247 530.2194 564.1820 625.1576 651.3117 671.1028 704.4359 766.3638 968.9157 979.0890 1006.9803 1066.7841 1113.9715 1115.8837 1132.5735 1133.8482 1183.5977 1417.9019 1421.1546 1454.9279 1455.9598 1473.4688 1478.2584 1484.6144 1582.2587 1605.1742 1665.7459 2971.3708 2978.7432 3071.8885 3084.3347 3112.8010 3115.9306 3361.0544 3555.3786 3633.4889 3707.6712
redmass: 4.9072 2.9345 3.0419 1.9609 1.8064 1.0951 3.3798 4.4372 6.1873 3.8867 2.3286 2.4147 3.7959 4.5530 5.4841 4.4889 1.2993 3.3744 1.1534 4.6954 9.5208 10.2177 5.3228 7.3230 1.1965 10.7724 10.8090 2.2181 1.7016 1.2397 1.2510 1.3122 1.3161 2.0737 1.1230 1.1169 1.0501 1.0513 1.0532 1.0762 3.5599 2.1013 1.2586 1.7254 1.0300 1.0300 1.1041 1.1033 1.1027 1.1044 1.0598 1.0453 1.0928 1.1050
irintensity: 7.7358 5.5894 8.5183 1.3887 0.8566 0.1615 4.1563 5.2286 4.6361 21.8275 9.5279 21.3786 40.2209 9.4952 9.1245 8.9647 338.7391 23.2775 48.5935 9.6809 134.6375 145.3651 22.9522 188.2151 237.5153 165.4621 162.1750 10.2964 1.5391 0.7665 0.6789 0.3701 2.0839 57.5230 1.1770 5.4757 8.2614 19.3722 16.5383 28.4284 144.2115 375.6446 208.5775 802.1577 66.9637 58.2221 27.3683 22.7416 19.9244 21.6901 178.6385 67.8308 57.1504 39.0431
temp: 298.150 k
press: 1.00000 atm
elementType: 16 15 8 8 7 7 7 6 6 6 1 1 1 1 1 1 1 1 1 1
symmnumber: 1
zpe: 394466.1 jmol-1
zpe.correction: 0.150244 hartree
zpe.thermalcorrener: 0.164276 hartree
zpe.thermalcorrenthalpy: 0.165220 hartree
zpe.thermalcorrgfe: 0.108053 hartree
zpe.sumelectzpe: -1173.493234 hartree
zpe.sumelectthermal: -1173.479203 hartree
zpe.sumelectthermalent: -1173.478258 hartree
zpe.sumelectthermalfe: -1173.535425 hartree
dipole: 4.6364 1.4418 -2.1134
dipole: 5.2954
quadrupole: -49.7103 -64.3171 -85.1891
quadrupole: -0.4554 5.0922 1.9122
quadrupole: 16.6952 2.0884 -18.7836 -0.4554 5.0922 1.9122
hfenergy: -1173.6434783 hartree
pointgroup: C01 [X(C3H10N3O2P1S1)]
dipole: 1.5523966 -1.0218385 0.9414657 debye
dipolederiv: -0.6540156 0.1093939 -0.1919588 0.0637744 -0.4757451 0.0461866 -0.1642182 0.0322041 -0.6926848 2.4893094 -0.6287034 0.2810679 0.0370959 1.6858194 -0.1691263 -0.0007936 0.1169362 1.8575832 -0.6386083 0.3105578 0.0048504 0.2479349 -1.2077895 -0.2427229 0.0373529 -0.3328645 -0.7309597 -1.1883775 -0.2088746 0.1836891 -0.3528963 -0.923831 0.3071373 0.2276854 0.2878478 -0.7597781 -2.1568297 0.6477457 -0.0614724 0.7593225 -0.9868933 0.0823347 -0.1453047 0.0713714 -0.6143724 -1.5141835 -0.0784858 0.1659225 -0.0838798 -0.4047839 -0.1503716 0.3640405 -0.162332 -0.6483388 -0.6045258 -0.0979119 -0.0828898 0.1736858 -1.068665 0.2172955 -0.1536895 0.2564478 -0.7014471 2.3616192 -0.1813389 -0.168576 -0.8469424 1.6066767 -0.3746909 -0.1256326 -0.3590078 0.3907769 0.2557895 -0.1185211 -0.0852652 -0.1156886 0.7488406 0.207842 0.0515208 -0.1595257 0.1158313 0.5890293 0.3378976 -0.2813972 0.0365167 0.2754438 -0.018763 -0.0645777 -0.0033243 0.2747494 -0.0551152 -0.1329791 0.02587 -0.0582316 -0.119209 -0.0159977 0.0247084 0.0620422 0.099578 0.0475885 0.060901 0.1029444 0.0689503 -0.0170944 -0.0662758 0.1134836 -0.0866261 -0.0459718 0.0162387 0.0273864 -0.0746632 -0.0186476 0.0548892 -0.0247463 -0.1450182 0.1081807 0.0217427 -0.0283703 -0.0406348 -0.0240614 0.0422398 0.1300999 0.0130182 -0.1298454 -0.0289593 -0.0328023 -0.0252483 -0.0286263 0.089981 0.054416 0.0319361 -0.1160195 0.1034501 -0.0582237 -0.0421067 0.0269612 -0.0140078 0.030785 -0.0500225 -0.1389908 0.0857094 0.0436493 0.0803491 0.0875294 0.1861052 0.0255604 -0.0013557 -0.0249961 0.1965039 0.1053517 -0.0668673 0.1090748 0.348179 0.2602529 0.0337815 -0.0098032 0.0598882 0.2071071 0.0592398 -0.0648711 0.0557051 0.3605839 0.148976 0.0327073 0.0691607 0.0703924 0.1775041 0.0362146 0.0840425 -0.0125607 0.3714621 0.4834042 -0.0558478 0.0271718 -0.062912 0.2281812 0.018384 0.0108848 0.0232651 0.3404457 unknown
polarizability: 129.1917714|-13.3638062|100.8595829|6.9393496|-7.9805389|90.328231 unknown
InChI: InChI=1S/C3H10N3O2PS/c1-7-9(10,8-2)6-3(4)5/h4-5H2,1-2H3
charge 0 multiplicity 1
20 atoms
S  -1.571542 0.633225 -1.871426
P  -0.457178 0.347654 -0.145296
O  -0.923731 1.400903 1.167534
O  -0.74561 -1.190093 0.688598
N  1.236816 0.45332 -0.222006
N  3.457282 -0.186719 -0.381117
N  1.898652 -1.79526 0.35729
C  2.146146 -0.509174 -0.077386
C  -1.392843 2.763631 0.853863
C  -2.14508 -1.573453 0.955947
H  -0.532604 3.431146 0.666243
H  -1.940292 3.09269 1.750869
H  -2.062673 2.756201 -0.026817
H  -2.756368 -1.447266 0.042711
H  -2.552289 -0.9579 1.776289
H  -2.116364 -2.634535 1.249627
H  4.240983 -0.756325 -0.073574
H  3.625015 0.750025 -0.739523
H  2.594416 -2.532759 0.274056
H  0.930963 -2.009312 0.639519
