program: Gaussian 09
title: 000262116
version: EM64L-G09RevD.01
frameworkgroup: C1[X(C21H21N5O4)]
method: RPBEPBE
basis: SDD
operation: Freq
keyword: #p
keyword: freq=noraman
keyword: PBEPBE/SDD
title: #p freq=noraman PBEPBE/SDD
converged: YES YES NO NO
title: Mulliken charges:
elementType: O O O O N N N N N C C C C C C C C C C C C C C C C C C C C C H H H H H H H H H H H H H H H H H H H H H
charge: -0.282602 -0.276791 -0.317581 -0.229541 -0.416039 -0.065798 0.032801 -0.444931 -0.667736 -0.339281 0.378731 0.495125 0.154749 -0.429677 -0.385207 -0.369192 -0.447290 0.066398 0.457958 -0.227171 -0.236203 -0.237444 -0.239794 0.259323 -0.571740 -0.249881 -0.247431 0.276529 -0.254579 -0.659393 0.290277 0.365239 0.249685 0.247210 0.251239 0.310995 0.225736 0.224255 0.225294 0.223291 0.226614 0.227932 0.225230 0.342107 0.370270 0.311557 0.225452 0.239177 0.219703 0.225342 0.247081
chargesum: 0.00000
title: Mulliken charges with hydrogens summed into heavy atoms:
elementType: O O O O N N N N N C C C C C C C C C C C C C C C C C C C C C
charge: -0.282602 -0.276791 -0.317581 -0.229541 -0.050800 -0.065798 0.032801 -0.102824 0.014091 -0.049004 0.378731 0.495125 0.154749 -0.179991 -0.137997 -0.117953 -0.136294 0.066398 0.457958 -0.001435 -0.011948 -0.012149 -0.016504 0.259323 -0.345125 -0.021948 -0.022201 0.276529 0.210050 0.032733
polarizability: 3.46308720e+02 -8.32888832e+00 3.48431406e+02 5.04957942e+00 -6.62835929e+00 2.13296609e+02
1716.lowfreq: -0.8339 -0.0012 -0.0011 -0.0010 1.5840 5.4171 19.3389 22.6194 29.1319
frequency: 19.3071 22.5250 29.1145 34.2925 35.1016 47.8305 53.6603 64.9199 66.1153 73.1411 92.6987 93.0227 109.8713 155.9479 172.9962 186.7340 199.7275 209.5714 221.5014 233.5608 250.9545 277.3841 294.9640 301.6422 327.6857 342.9679 365.9996 392.8162 403.5178 406.4677 407.6833 433.2794 457.2447 476.8310 505.4682 520.8964 540.7674 587.8715 596.5485 604.4664 614.1019 617.2684 625.0644 647.9979 649.8205 659.8020 678.2496 699.0747 704.4382 708.5474 709.5130 718.5823 729.7005 745.0564 767.1387 772.8533 776.2965 794.6036 800.0928 806.5064 841.1793 859.0498 863.2891 864.2774 871.9471 931.2832 934.0734 943.3266 982.3668 983.1289 986.4505 990.0802 990.4088 997.0856 1005.2223 1023.6823 1028.8966 1030.1947 1033.6550 1068.0230 1083.3576 1086.3116 1092.5963 1097.4274 1138.1402 1157.6072 1171.4121 1172.2176 1172.8140 1186.4283 1194.1645 1196.8108 1207.1141 1214.7667 1219.1672 1242.2859 1271.0270 1283.1745 1295.2419 1321.6951 1332.9873 1354.1260 1357.7865 1379.9662 1385.9837 1392.4268 1406.3915 1424.5864 1435.5754 1447.4163 1459.0021 1463.6369 1474.0263 1483.8270 1484.0078 1485.9744 1505.1105 1523.3382 1569.7652 1584.7268 1591.6183 1594.8592 1598.2421 1610.9030 1615.1767 1687.3083 2992.3472 3020.5843 3031.0525 3087.9420 3091.6034 3116.3488 3118.0777 3122.2328 3123.1551 3129.2658 3134.8986 3141.7400 3144.1583 3144.3581 3149.6153 3159.6209 3164.1560 3326.0461 3361.9239 3551.3968 3637.3839
redmass: 5.2513 4.3929 4.5954 4.2892 6.0024 4.0647 5.9305 4.5046 5.9064 4.8195 6.3645 5.0532 6.0477 4.3775 5.0979 5.9006 4.3930 1.8099 3.1878 5.0141 5.3599 3.4203 6.2984 4.6838 4.5624 6.1730 4.7456 5.0731 2.8421 3.5313 4.3351 4.5381 4.4859 3.6107 1.1670 7.1652 4.6987 4.8392 3.1533 2.8433 5.7049 6.3950 5.4041 2.5843 3.8266 4.3794 7.0824 5.8456 1.9811 4.1530 1.8922 4.8380 2.9568 1.8827 1.2399 3.8751 2.3071 1.2868 1.9809 1.2280 3.3679 1.2624 4.0336 1.2545 3.4389 1.8914 2.2547 1.7149 4.1293 1.4046 1.7321 6.0397 3.0733 1.3138 1.3699 3.3261 3.0295 2.4339 2.9381 1.8313 2.7724 2.0346 1.9533 2.3278 3.0375 1.7644 1.9377 1.2892 1.1269 2.4858 1.1399 1.2374 3.2556 2.0651 2.1005 4.9647 1.5637 1.1095 1.7320 1.6020 1.9296 1.3534 1.2410 7.1937 4.9839 1.2378 3.8560 2.5153 2.2542 2.0949 1.0913 1.0553 3.4723 1.3484 1.5441 2.1784 2.9419 2.6395 1.7444 3.4951 5.5444 6.0721 4.4945 5.7937 6.0138 8.5539 1.0361 1.0825 1.0597 1.0973 1.1032 1.0856 1.1062 1.0844 1.0877 1.0875 1.0926 1.0921 1.0930 1.0962 1.0960 1.1015 1.1015 1.0792 1.0579 1.0762 1.0930
irintensity: 0.5200 0.6650 0.7694 0.1902 0.0388 0.2067 0.7229 1.0075 5.9806 0.5375 0.0119 1.6085 0.5604 0.6071 3.1376 2.0014 1.8390 4.2692 0.2909 3.8513 3.1530 1.9809 1.4692 1.2700 19.0723 0.5026 15.7179 6.2861 0.0666 2.8281 3.2071 7.3704 1.4654 4.5575 123.2456 9.9881 13.0743 21.2003 18.1318 10.0718 1.8027 1.0455 5.2231 51.9196 7.4717 19.7799 12.3873 3.6668 40.9443 26.3239 38.4768 26.2721 50.4890 56.6971 55.7849 6.7912 28.4913 69.2456 163.6122 6.5577 24.0495 3.5627 6.5033 0.5983 17.0190 33.7451 32.7844 12.8162 5.0564 0.5976 0.2292 1.1786 0.2850 0.3511 3.9171 87.6672 84.8402 29.1472 10.7938 76.3050 206.7880 186.5925 151.4397 52.7808 220.0721 14.2931 33.0252 14.5144 4.3286 7.4590 10.6778 2.9712 77.9483 6.4153 53.1015 414.7366 7.8781 5.3086 17.3897 1.5853 5.8488 0.2604 12.5824 4.1836 1.4006 34.0901 131.0422 154.8194 7.2701 5.9625 28.4380 5.7280 261.9867 2.4819 30.8288 22.8302 571.9740 159.4290 177.5110 430.1507 148.8722 4.3990 812.4976 9.8379 6.9503 279.6382 19.9638 26.9229 35.0108 37.7707 1.3184 3.9131 37.2399 2.0911 9.6289 1.0107 26.2504 20.4073 14.1650 6.1854 36.9547 42.7096 25.3842 47.4921 131.1234 52.6586 67.4273
temp: 298.150 k
press: 1.00000 atm
elementType: 8 8 8 8 7 7 7 7 7 6 6 6 6 6 6 6 6 6 6 6 6 6 6 6 6 6 6 6 6 6 1 1 1 1 1 1 1 1 1 1 1 1 1 1 1 1 1 1 1 1 1
symmnumber: 1
zpe: 1036383.9 jmol-1
zpe.correction: 0.394738 hartree
zpe.thermalcorrener: 0.421810 hartree
zpe.thermalcorrenthalpy: 0.422755 hartree
zpe.thermalcorrgfe: 0.333870 hartree
zpe.sumelectzpe: -1385.314284 hartree
zpe.sumelectthermal: -1385.287211 hartree
zpe.sumelectthermalent: -1385.286267 hartree
zpe.sumelectthermalfe: -1385.375152 hartree
dipole: 6.6704 -0.5967 -1.0973
dipole: 6.7863
quadrupole: -146.2805 -164.9159 -171.7035
quadrupole: 17.6304 1.7737 -5.0469
quadrupole: 14.6861 -3.9493 -10.7368 17.6304 1.7737 -5.0469
hfenergy: -1385.7090218 hartree
pointgroup: C01 [X(C21H21N5O4)]
dipole: -2.4667361 0.1082744 1.0159412 debye
polarizability: 307.5073968|13.2552942|336.4077753|-58.5137392|34.7628665|264.1215627 unknown
InChI: InChI=1S/C21H21N5O4/c1-2-30-21(27)24-17-13-16(22)19(26(28)29)20(23-17)25-18(14-9-5-3-6-10-14)15-11-7-4-8-12-15/h3-13,18,24-25H,2,22H2,1H3
charge 0 multiplicity 1
51 atoms
O  0.910937 -4.871024 -1.267279
O  1.999323 -2.903872 -1.581328
O  -4.879073 0.960244 1.469456
O  -2.619889 1.566325 1.190551
N  0.890219 -0.640013 -0.934013
N  -1.258847 -0.695899 -0.059231
N  0.929889 -3.556668 -1.178652
N  -3.453162 -0.647528 0.824302
N  -1.480099 -4.921142 -0.280046
C  0.944282 0.833699 -0.790617
C  1.608352 1.473863 -2.019781
C  1.603676 1.204843 0.549754
C  -0.183598 -1.385515 -0.543969
C  1.713252 0.792481 -3.258139
C  3.005204 1.088546 0.733123
C  2.061333 2.81725 -1.944744
C  0.792774 1.626737 1.631874
C  -0.191503 -2.846204 -0.655828
C  -1.386555 -3.555103 -0.218545
C  2.270105 1.432408 -4.389689
C  3.589777 1.389852 1.981874
C  2.608902 3.459568 -3.075385
C  1.380936 1.933438 2.881127
C  -2.350797 -1.381566 0.33842
C  -2.469406 -2.789139 0.286682
C  2.720112 2.768445 -4.304612
C  2.778092 1.814887 3.060955
C  -3.525774 0.709406 1.153026
C  -5.18796 2.34429 1.932168
C  -4.97239 2.478676 3.44187
H  -0.108684 1.16776 -0.740017
H  1.70933 -1.18213 -1.256703
H  1.355049 -0.238718 -3.347182
H  3.639885 0.773873 -0.104482
H  1.98758 3.358322 -0.994705
H  -0.292538 1.699528 1.494466
H  2.349143 0.88559 -5.336196
H  4.673699 1.296422 2.114762
H  2.951652 4.497565 -2.996558
H  0.747609 2.263623 3.712596
H  -3.370378 -3.296753 0.644788
H  3.150795 3.264358 -5.181702
H  3.232122 2.051703 4.030161
H  -4.3296 -1.156035 0.959062
H  -0.666224 -5.432453 -0.649288
H  -2.327345 -5.389318 0.032927
H  -6.244213 2.480684 1.650118
H  -4.551675 3.050514 1.370527
H  -5.282845 3.486898 3.773771
H  -5.571117 1.734432 3.994924
H  -3.908059 2.346149 3.699805
