program: Gaussian 09
title: 000262047
version: EM64L-G09RevD.01
frameworkgroup: C1[X(C14H15O2P)]
method: RPBEPBE
basis: SDD
operation: Freq
keyword: #p
keyword: freq=noraman
keyword: PBEPBE/SDD
title: #p freq=noraman PBEPBE/SDD
converged: YES YES NO NO
title: Mulliken charges:
elementType: P O O C C C C C C C C C C C C C C H H H H H H H H H H H H H H H
charge: 1.086791 -0.677576 -0.624369 -0.132304 -0.164538 -0.423522 -0.369405 -0.308607 -0.308284 0.454539 0.457519 -0.202219 -0.197267 -0.353820 -0.411398 -0.808911 -0.807169 0.269342 0.248265 0.275697 0.289472 0.232909 0.233580 0.234398 0.235680 0.382154 0.228714 0.235216 0.230617 0.236308 0.232248 0.225936
chargesum: 0.00000
title: Mulliken charges with hydrogens summed into heavy atoms:
elementType: P O O C C C C C C C C C C C C C C
charge: 1.086791 -0.295422 -0.624369 -0.132304 -0.164538 -0.154179 -0.121140 -0.032910 -0.018812 0.454539 0.457519 0.030691 0.036313 -0.119422 -0.175717 -0.114364 -0.112677
polarizability: 2.11049799e+02 9.65787291e+00 1.83446790e+02 9.68595784e-01 2.01728376e+01 1.33691072e+02
1716.lowfreq: -25.1288 0.0012 0.0018 0.0018 5.2034 7.6325 14.5018 19.1356 31.9005
frequency: -24.1247 18.7083 31.6179 36.9495 41.0594 103.7028 136.9012 144.1863 191.4152 207.3368 216.2077 225.8610 239.1605 252.9373 278.9088 306.6749 366.7813 378.0422 414.9760 423.8465 438.5849 470.9542 515.2681 516.6279 543.5345 550.8584 649.1579 685.1301 685.3773 702.0140 708.7068 800.4223 804.8254 837.7834 850.4784 889.7952 908.5380 931.9212 937.4394 981.5978 984.6953 986.8950 992.0002 993.7428 996.6884 998.3118 1031.1080 1049.4241 1050.4611 1085.8654 1088.6253 1107.0653 1118.5789 1180.6409 1184.9932 1226.7602 1229.4047 1300.7064 1304.7409 1377.0269 1379.6492 1398.6329 1398.6810 1411.2640 1416.7157 1463.5298 1466.9835 1470.7665 1471.2731 1478.5620 1479.5449 1586.6285 1589.5098 1606.4457 1609.7622 2978.5847 2979.1992 3057.8750 3059.1781 3086.3469 3087.6809 3120.8342 3123.5919 3127.1803 3140.8222 3141.4468 3146.9395 3159.8833 3160.9725 3595.8498
redmass: 1.0221 3.5831 4.1285 1.0355 5.2652 5.3428 4.4857 5.0513 2.4182 2.9538 2.6990 4.7000 5.7053 5.6365 2.1039 3.1739 3.6440 4.3096 3.9538 3.2727 2.9507 5.7512 5.0243 5.1209 4.7904 4.3554 9.3015 6.3330 7.4174 2.2899 2.3478 1.4026 1.4225 4.9555 4.6244 1.3400 1.3068 1.3705 1.3507 2.5638 3.8025 2.1073 1.4479 1.7757 1.5856 1.3628 2.6535 1.5598 1.5639 2.1733 2.0464 1.5546 1.6092 1.1118 1.1022 2.6057 2.7168 1.2964 1.2803 6.9491 6.6203 1.2573 1.2673 2.6275 2.4355 2.0851 2.1001 1.0481 1.0544 1.1861 1.2086 5.6491 5.6682 6.1800 6.2028 1.0372 1.0377 1.0977 1.0970 1.0991 1.0992 1.0881 1.0879 1.0912 1.0908 1.0911 1.0921 1.0992 1.0992 1.0660
irintensity: 0.4760 0.0040 0.2869 0.2944 0.3448 0.9031 0.7635 1.7432 25.5169 1.2374 16.5605 2.1650 3.5840 15.9868 77.7314 25.8401 21.6285 25.7715 12.0104 0.7410 19.6609 107.5808 0.6153 0.7868 50.5385 9.9203 57.2980 18.6667 62.8197 42.6787 95.7735 17.7731 37.7819 7.8799 6.6560 1.3922 2.1197 1.2579 0.9147 8.9741 13.6817 3.7284 0.4538 2.2317 24.2078 2.2575 94.2677 10.2014 14.4116 8.3461 6.9369 55.8879 42.0163 2.1800 1.4430 3.1196 2.5909 0.3291 3.5699 0.8565 3.5203 2.1123 22.9456 7.2200 11.3014 5.1816 33.2676 14.8467 12.5548 18.4232 15.2297 0.9727 0.8082 5.6558 14.2275 27.0384 32.6382 18.3997 19.0180 17.2385 17.8376 11.3612 9.9471 6.8354 10.0035 4.8325 3.7694 26.1117 17.0812 43.1503
temp: 298.150 k
press: 1.00000 atm
elementType: 15 8 8 6 6 6 6 6 6 6 6 6 6 6 6 6 6 1 1 1 1 1 1 1 1 1 1 1 1 1 1 1
symmnumber: 1
zpe: 657386.0 jmol-1
zpe.correction: 0.250385 hartree
zpe.thermalcorrener: 0.267091 hartree
zpe.thermalcorrenthalpy: 0.268036 hartree
zpe.thermalcorrgfe: 0.203958 hartree
zpe.sumelectzpe: -1032.943070 hartree
zpe.sumelectthermal: -1032.926363 hartree
zpe.sumelectthermalent: -1032.925419 hartree
zpe.sumelectthermalfe: -1032.989497 hartree
dipole: -0.8516 4.8122 -0.8496
dipole: 4.9603
quadrupole: -89.8531 -113.0438 -102.9392
quadrupole: 2.3880 -3.7833 5.4201
quadrupole: 12.0923 -11.0984 -0.9939 2.3880 -3.7833 5.4201
hfenergy: -1033.1934549 hartree
pointgroup: C01 [X(C14H15O2P1)]
dipole: 0.2774752 1.9185548 0.2249013 debye
polarizability: 211.4517647|-8.2923296|180.3304702|3.6009991|-23.1249848|136.4054256 unknown
InChI: InChI=1S/C14H15O2P/c1-11-5-3-7-13(9-11)17(15,16)14-8-4-6-12(2)10-14/h3-10,15H,1-2H3
charge 0 multiplicity 1
32 atoms
P  0.085725 -1.443826 -0.713911
O  -0.060363 -0.936405 -2.391023
O  0.21977 -3.017125 -0.431931
C  -1.471577 -0.669594 -0.072514
C  1.591446 -0.523067 -0.106926
C  -2.044322 0.47068 -0.68162
C  1.807731 0.836491 -0.4228
C  -2.072329 -1.272348 1.054769
C  2.516068 -1.241734 0.686015
C  -3.232132 1.039579 -0.16044
C  2.959795 1.511728 0.056399
C  -3.254534 -0.706319 1.582264
C  3.665222 -0.576885 1.165324
C  -3.822581 0.439015 0.983664
C  3.880255 0.785949 0.855851
C  -3.868359 2.254981 -0.812778
C  3.20159 2.970264 -0.292947
H  -1.584558 0.890257 -1.582633
H  1.086912 1.377408 -1.048255
H  -1.63274 -2.175235 1.492684
H  2.32889 -2.299193 0.903241
H  -3.73347 -1.16224 2.455536
H  4.391747 -1.118161 1.781141
H  -4.741976 0.868787 1.400919
H  4.77449 1.293717 1.237306
H  0.619423 -1.348988 -2.981976
H  -3.279055 2.605911 -1.676884
H  -4.889085 2.026912 -1.172909
H  -3.955915 3.094914 -0.098352
H  3.452085 3.088553 -1.364486
H  2.304368 3.585862 -0.098822
H  4.03588 3.392714 0.292595
