program: Gaussian 09
title: 000262019
version: EM64L-G09RevD.01
frameworkgroup: C1[X(C9H9N3)]
method: RPBEPBE
basis: SDD
operation: Freq
keyword: #p
keyword: freq=noraman
keyword: PBEPBE/SDD
title: #p freq=noraman PBEPBE/SDD
converged: YES YES NO NO
title: Mulliken charges:
elementType: N N N C C C C C C C C C H H H H H H H H H
charge: -0.084075 -0.000538 -0.031091 -0.288975 0.401768 0.323575 -0.348582 -0.318767 -0.816044 -0.603215 -0.168737 -0.286814 0.270616 0.250934 0.267396 0.226132 0.230800 0.253141 0.240506 0.251288 0.230681
chargesum: 0.00000
title: Mulliken charges with hydrogens summed into heavy atoms:
elementType: N N N C C C C C C C C C
charge: -0.084075 -0.000538 -0.031091 -0.018358 0.401768 0.323575 -0.097648 -0.051370 -0.105972 0.119260 -0.168737 -0.286814
polarizability: 1.46195977e+02 -5.79666915e+00 1.19288939e+02 -4.51450081e+00 -5.64322080e-02 7.60165063e+01
1716.lowfreq: -2.9493 -0.0005 -0.0005 -0.0004 9.5438 12.3391 31.5707 58.4346 98.4836
frequency: 31.5104 58.2881 98.4792 122.6307 141.2662 166.8286 192.0699 215.9609 266.1399 320.4275 370.5837 387.1446 414.6316 461.7289 498.1469 506.0932 540.3044 556.0343 602.4452 641.1419 836.4234 870.7739 890.4551 896.2449 942.0056 983.9991 1018.5941 1047.2787 1090.2111 1117.0282 1142.4439 1165.8304 1263.4301 1267.5697 1284.7620 1336.7729 1358.9699 1404.0334 1406.0732 1448.4580 1456.4415 1467.7385 1475.1241 1494.9156 1624.6540 1700.2631 2152.0693 2176.6662 2956.8391 2961.8716 2981.3195 3032.5077 3062.3612 3085.9333 3110.3254 3158.9391 3170.1986
redmass: 4.9353 1.3224 7.7554 4.0395 5.0684 1.9999 1.6082 2.4926 2.5989 5.0744 4.1732 5.0900 4.3983 8.8956 5.8635 4.5127 4.8444 6.3692 4.7198 5.7688 1.8253 2.4323 1.7040 3.1565 3.7429 5.5181 1.7033 1.4808 1.4796 1.3078 2.2419 2.0073 3.7836 1.4958 1.3608 2.0093 1.8405 1.9562 1.5187 1.2122 1.0466 1.0424 1.0771 1.1024 6.4490 6.3717 12.6093 12.5366 1.0824 1.0380 1.0351 1.0971 1.1027 1.0978 1.0995 1.0930 1.0946
irintensity: 1.9564 0.1369 1.5415 3.1317 4.1926 3.0350 0.2350 2.3446 0.5726 0.6822 1.3688 0.7339 1.2622 2.0916 5.5742 7.4324 2.6564 3.5606 1.9456 3.6838 4.2025 7.7504 23.4072 18.1329 11.6067 18.5195 0.3121 3.8999 38.3699 6.6496 34.4512 35.0092 31.4036 20.3726 16.3804 7.9627 25.1033 42.5125 50.5670 3.2216 16.2241 14.9648 15.5924 41.6065 209.8648 36.9770 99.8768 1.2507 11.0960 34.7881 79.3174 16.7856 25.2584 20.4173 11.0284 12.3381 0.6461
temp: 298.150 k
press: 1.00000 atm
elementType: 7 7 7 6 6 6 6 6 6 6 6 6 1 1 1 1 1 1 1 1 1
symmnumber: 1
zpe: 421273.2 jmol-1
zpe.correction: 0.160454 hartree
zpe.thermalcorrener: 0.172569 hartree
zpe.thermalcorrenthalpy: 0.173513 hartree
zpe.thermalcorrgfe: 0.121445 hartree
zpe.sumelectzpe: -511.695119 hartree
zpe.sumelectthermal: -511.683004 hartree
zpe.sumelectthermalent: -511.682060 hartree
zpe.sumelectthermalfe: -511.734128 hartree
dipole: -8.5285 -0.0199 -1.7190
dipole: 8.7000
quadrupole: -77.0663 -70.4504 -76.4541
quadrupole: 8.9697 -5.1470 -10.8847
quadrupole: -2.4093 4.2065 -1.7972 8.9697 -5.1470 -10.8847
hfenergy: -511.8555735 hartree
pointgroup: C01 [X(C9H9N3)]
dipole: -3.3523011 -0.3749901 -0.580878 debye
dipolederiv: -1.3531404 0.230995 0.1399719 0.2279811 -0.9222957 0.1499165 0.1568157 0.1925706 -0.2341327 -0.2332904 -0.0137645 0.0086154 -0.0292227 -0.2537048 0.0055553 -0.0731831 -0.080832 -0.209642 -0.6081285 0.1800615 0.0661864 0.163506 -0.3072877 -0.0297881 0.0682379 -0.0365587 -0.267996 0.1358046 0.2309995 -0.0217065 0.1732179 0.2396285 0.0559617 0.0051134 0.0885583 0.3421531 0.1210479 -0.2091609 0.0982507 -0.0473062 0.0472022 -0.1675646 0.0208322 -0.0443781 -0.1289014 -0.7441709 0.2365772 0.0047392 -0.2685149 0.1765027 0.0061081 0.2365635 -0.1058871 -0.1535031 0.0354801 -0.1473538 0.0218865 -0.1420502 0.7456729 -0.170151 0.0432928 -0.2978262 -0.0898839 1.4296927 -0.2792414 -0.1431299 -0.0443604 -0.0227924 -0.0129588 -0.2832628 0.0649194 -0.0275337 0.0333078 -0.0308646 -0.013898 0.0427271 -0.0492738 0.0450263 -0.0324958 0.042496 0.0676583 0.5852765 0.2875968 -0.1408941 0.3280981 0.2572918 -0.069336 -0.1394274 -0.0666126 0.2904165 -0.058308 -0.0625132 0.0291146 -0.0327706 -0.0905231 0.0425912 0.0400937 0.0324739 -0.0054452 0.7346115 -0.3556879 -0.122388 -0.2980387 -0.0110325 0.0721732 -0.1105958 0.0813191 0.0489191 0.034463 -0.0911094 0.0400362 -0.0751655 0.0234141 0.0240716 0.0369584 0.0364142 -0.030957 -0.0746155 0.0495882 -0.0110653 0.031924 0.074655 0.0260733 -0.0003678 0.0288674 0.1801472 0.097958 -0.0177377 0.0087283 0.0085872 -0.0328689 0.0353583 -0.0201594 0.0574821 0.1799271 -0.1422802 0.0910781 -0.0291525 0.0031528 0.0646716 0.0216902 0.0093388 0.0158271 0.1060814 0.0633687 -0.0013217 0.1036622 0.0199789 0.0304458 0.0193135 0.0563821 0.0938529 -0.0998679 0.0610532 -0.0675389 -0.0688685 -0.0425052 -0.0670432 -0.0422438 -0.0532861 -0.0992262 0.0309434 -0.1344649 -0.0817494 -0.0524474 -0.0133844 0.106606 0.0359715 -0.1302614 -0.0133752 -0.0154584 -0.0433396 -0.0614458 0.0860881 -0.0106399 0.0721001 -0.0883843 0.15529 -0.0118318 -0.0950932 0.0596745 0.1125929 -0.0037295 0.0047856 -0.0813687 0.0406158 0.0141211 0.021747 0.1121684 unknown
polarizability: 146.8357261|-3.1632553|118.2946975|-6.103122|-2.0236755|76.370999 unknown
InChI: InChI=1S/C9H9N3/c1-7-5-12(2)6-8(3-10)9(7)4-11/h5-6,9H,1-2H3
charge 0 multiplicity 1
21 atoms
N  -1.708027 -1.036423 0.27137
N  1.606356 2.068299 1.67506
N  3.008403 -1.834965 -0.656495
C  0.508563 0.758114 -0.401657
C  -0.972508 1.157147 -0.527897
C  0.647852 -0.766227 -0.239282
C  -1.95608 0.291438 -0.149028
C  -0.42899 -1.542263 0.147944
C  -1.264305 2.549323 -1.02964
C  -2.826914 -1.861113 0.760215
C  1.135371 1.488502 0.743915
C  1.923219 -1.363108 -0.456061
H  1.055122 1.089212 -1.309677
H  -3.011549 0.575758 -0.188309
H  -0.305066 -2.612103 0.335694
H  -2.347463 2.757892 -1.054391
H  -0.86516 2.696329 -2.053166
H  -0.783374 3.312812 -0.387001
H  -3.656333 -1.865228 0.029537
H  -3.205207 -1.483008 1.727637
H  -2.486212 -2.898787 0.903131
