program: Gaussian 09
title: 000262080
version: EM64L-G09RevD.01
frameworkgroup: C1[X(C20H26BrFO2)]
method: RPBEPBE
basis: SDD
operation: Freq
keyword: #p
keyword: freq=noraman
keyword: PBEPBE/SDD
title: #p freq=noraman PBEPBE/SDD
converged: NO YES NO NO
title: Mulliken charges:
elementType: Br F O O C C C C C C C C C C C C C C C C C C C C H H H H H H H H H H H H H H H H H H H H H H H H H H
charge: -0.006623 -0.227304 -0.451905 -0.247256 0.359920 -0.142193 -0.131734 -0.281666 0.223763 -0.597064 -0.540017 -0.066563 -0.488479 0.108354 -0.459903 -0.776050 -0.647246 0.635563 -0.816033 -0.747588 -0.153587 -0.645898 -0.396350 0.186640 0.241882 0.244495 0.261843 0.234524 0.222820 0.222449 0.258876 0.248401 0.217814 0.235209 0.244942 0.228881 0.233545 0.221518 0.223683 0.245504 0.211362 0.247981 0.236659 0.243303 0.221976 0.267673 0.253540 0.325912 0.260681 0.253750
chargesum: 0.00000
title: Mulliken charges with hydrogens summed into heavy atoms:
elementType: Br F O O C C C C C C C C C C C C C C C C C C C C
charge: -0.006623 -0.227304 -0.125993 -0.247256 0.359920 0.099688 0.112761 -0.281666 0.223763 -0.100697 -0.094748 0.192314 -0.022264 0.108354 0.020247 -0.092106 -0.178060 0.635563 -0.120032 -0.014635 0.099952 -0.385217 -0.142600 0.186640
polarizability: 2.90934786e+02 -4.91321420e+00 1.98150050e+02 1.69940166e+01 1.77175520e+00 2.00055994e+02
1716.lowfreq: -8.5516 -0.0005 -0.0004 0.0002 2.7756 11.8099 38.5702 54.3858 70.5355
frequency: 38.5608 54.3634 70.5043 82.0662 106.5629 124.1407 134.2997 162.9382 168.6069 186.0683 194.4636 200.2170 212.8121 218.8762 242.3201 252.6485 254.9423 266.7542 283.3949 296.0317 304.6871 313.5399 315.3137 327.4184 342.1467 364.4150 380.7750 394.9955 412.5109 426.2824 436.5007 467.3866 479.6454 486.6620 504.7621 520.3849 547.6210 557.3716 578.6259 617.4156 632.0769 663.8841 688.1480 693.8933 734.8544 756.6882 793.1929 796.6686 811.5587 823.6185 835.5040 854.1961 872.3647 900.4370 903.1810 913.7060 918.7893 932.9746 949.9744 952.2302 969.5242 974.2757 996.3650 998.4355 1002.7722 1018.8294 1032.0860 1041.7397 1067.6575 1073.3893 1090.7865 1097.7848 1105.3860 1118.3234 1128.2740 1138.8518 1152.6696 1160.8625 1169.3129 1184.3200 1199.8879 1200.3845 1218.4759 1232.6006 1245.7576 1248.4723 1272.7639 1278.9733 1282.8930 1283.9359 1290.8481 1299.9173 1310.3683 1318.7628 1323.2307 1328.2230 1347.6328 1352.5115 1358.6198 1360.3540 1381.2492 1392.7582 1395.4490 1406.5459 1444.9666 1455.6756 1462.8569 1468.7784 1469.1540 1470.8561 1476.0512 1477.0273 1484.2642 1486.8574 1494.0558 1558.0659 1617.7665 1666.1734 2952.8314 2959.2166 2970.8070 2974.0091 2989.8058 2995.5044 2999.9509 3004.8656 3007.9597 3018.9182 3046.4892 3052.0276 3055.5411 3061.0849 3061.4684 3062.5120 3082.6670 3085.3542 3094.8437 3095.4709 3109.9730 3111.8212 3129.4046 3137.7943 3152.8750 3540.7878
redmass: 8.0232 5.9510 4.7284 3.6638 2.2686 4.6004 4.9036 5.0902 4.5294 3.8219 2.5201 2.4738 2.7701 1.8538 2.4118 3.0300 2.0741 1.3721 1.9787 2.4801 2.0597 2.8984 2.3071 3.4377 2.3630 3.8913 2.6010 2.7012 3.0207 3.1976 3.3439 3.9205 3.1213 3.3191 4.1751 4.0006 2.5588 3.3699 3.9018 4.2877 4.1537 4.2665 2.9678 3.5667 3.8313 4.3296 3.1209 1.8112 2.0735 1.8108 1.9922 2.5455 2.8523 1.8657 2.3451 1.8392 2.0793 2.0213 1.7934 2.1075 2.1305 2.2772 1.7119 2.7010 2.2573 1.8018 2.0976 1.8640 1.8635 2.0472 2.1326 1.8311 2.4028 2.2735 2.2598 2.0715 2.1045 2.0060 2.0051 1.9159 1.5149 1.7599 1.5028 1.4422 1.6772 1.4826 1.2827 1.4115 1.4478 1.7402 2.0825 1.4927 1.3303 1.6881 1.4594 1.4547 1.9451 1.4350 1.4666 1.5134 1.7809 1.2351 1.2458 1.1858 1.0828 1.0827 1.0655 1.0837 1.0611 1.0559 1.0614 1.0601 1.0608 1.0553 1.0787 8.6587 8.6192 7.4105 1.0784 1.0664 1.0540 1.0654 1.0616 1.0609 1.0604 1.0362 1.0371 1.0641 1.0935 1.0980 1.0998 1.0983 1.0989 1.0894 1.0992 1.1030 1.0977 1.0999 1.0998 1.0866 1.0919 1.0982 1.0980 1.0657
irintensity: 2.8536 1.5500 1.3468 0.5664 1.6765 0.4748 3.7986 3.6905 0.9097 0.1407 0.6053 4.7831 0.7804 1.5182 0.7386 11.3308 3.2446 90.4878 16.5661 16.8463 2.5611 2.3378 1.5846 5.4776 0.9174 9.8612 2.4120 0.9469 4.9901 2.4410 2.4052 6.3744 13.9768 11.0798 5.2300 0.5852 6.0599 2.7804 3.5258 1.0890 7.1419 4.5820 12.2536 6.3336 30.7407 3.8810 7.8074 16.9987 3.9734 21.2455 5.6947 3.3679 2.2446 32.4369 32.1042 18.1486 3.7363 18.1910 7.1275 8.9215 6.4417 11.7491 1.1542 7.6511 4.2831 4.5063 19.8304 1.0225 42.8536 14.3071 36.9154 16.5036 12.5851 28.5305 8.0764 28.6789 0.2490 4.2362 15.5300 10.2427 11.5777 0.6992 0.7329 14.3247 20.0671 3.2100 5.8779 35.7835 10.6868 3.5422 10.8509 13.8120 3.5870 10.7241 2.4995 2.3846 1.6536 2.1332 3.6620 0.2077 13.1287 30.8255 1.1733 26.6990 9.9804 17.6500 10.7529 10.9510 9.6763 11.2350 8.6503 3.6908 5.6203 6.0898 7.8114 194.8674 16.3749 123.8058 1.0172 18.8023 7.2121 19.3963 21.5271 30.9492 30.3551 19.7731 21.3612 30.4117 25.4575 9.9951 28.5126 7.4534 17.8865 31.4979 31.2162 35.6833 20.5321 29.6062 25.9885 7.0643 8.6682 5.1820 11.8531 4.4583
temp: 298.150 k
press: 1.00000 atm
elementType: 35 9 8 8 6 6 6 6 6 6 6 6 6 6 6 6 6 6 6 6 6 6 6 6 1 1 1 1 1 1 1 1 1 1 1 1 1 1 1 1 1 1 1 1 1 1 1 1 1 1
symmnumber: 1
zpe: 1090969.0 jmol-1
zpe.correction: 0.415528 hartree
zpe.thermalcorrener: 0.438619 hartree
zpe.thermalcorrenthalpy: 0.439563 hartree
zpe.thermalcorrgfe: 0.365770 hartree
zpe.sumelectzpe: -1039.632743 hartree
zpe.sumelectthermal: -1039.609652 hartree
zpe.sumelectthermalent: -1039.608707 hartree
zpe.sumelectthermalfe: -1039.682501 hartree
dipole: -4.8791 0.0859 -1.2963
dipole: 5.0491
quadrupole: -197.9717 -145.6759 -149.7601
quadrupole: 3.4998 -15.7053 8.5588
quadrupole: -33.5025 18.7933 14.7091 3.4998 -15.7053 8.5588
hfenergy: -1040.0482709 hartree
pointgroup: C01 [X(C20H26Br1F1O2)]
dipole: -1.9068974 -0.0945007 -0.5485604 debye
polarizability: 290.0170466|-0.5919979|199.1419477|19.9044269|1.9790156|199.9818363 unknown
InChI: InChI=1S/C20H26BrFO2/c1-17-8-6-13(23)10-12(17)4-5-15-14-7-9-19(3,24)18(14,2)11-16(22)20(15,17)21/h6,8,10,14-16,24H,4-5,7,9,11H2,1-3H3
charge 0 multiplicity 1
50 atoms
Br 0.755062 -0.029591 2.125526
F  -0.307512 2.28606 -1.224785
O  -5.138886 0.804903 -0.034329
O  5.785443 -0.095201 1.100761
C  -2.604388 0.434011 -0.11159
C  -1.816516 -0.89519 0.108683
C  -0.399138 -0.875075 -0.499286
C  0.438077 0.311288 0.059385
C  -4.001005 0.045535 0.536625
C  -1.815557 1.577042 0.570941
C  -2.805589 -1.994538 -0.354184
C  -0.341291 1.662213 0.130377
C  -4.202893 -1.438889 0.076362
C  1.895227 0.376634 -0.572791
C  0.330475 -2.229541 -0.343873
C  -2.840132 0.75068 -1.614676
C  1.783941 -2.193429 -0.882825
C  2.56357 -0.992333 -0.383456
C  -4.055702 0.18852 2.073514
C  1.854187 0.648851 -2.133021
C  2.710134 1.519462 0.007526
C  3.819369 -1.110529 0.14389
C  3.96383 1.373543 0.516759
C  4.610638 0.042515 0.622259
H  -1.682409 -1.019879 1.203384
H  -0.499826 -0.668227 -1.586334
H  -1.810832 1.438928 1.66763
H  -2.267339 2.56769 0.366061
H  -2.588666 -2.972492 0.109637
H  -2.754622 -2.134299 -1.450696
H  0.206357 2.377938 0.766232
H  -4.925768 -1.444595 -0.756766
H  -4.643723 -2.036325 0.893638
H  -0.240104 -3.006876 -0.884497
H  0.338818 -2.511252 0.725442
H  -1.894219 0.854229 -2.168925
H  -3.459708 -0.021879 -2.099284
H  -3.385054 1.704221 -1.718731
H  1.747712 -2.165146 -1.992432
H  2.313584 -3.123367 -0.609064
H  -3.960813 1.244659 2.393657
H  -5.029665 -0.186609 2.434193
H  -3.260174 -0.388109 2.578869
H  2.875209 0.512951 -2.529523
H  1.183206 -0.048901 -2.660753
H  1.519016 1.673461 -2.346104
H  2.266577 2.519762 -0.081176
H  -5.136634 1.72088 0.346264
H  4.296215 -2.093717 0.243193
H  4.544918 2.230212 0.877099
