program: Gaussian 09
title: 000262002
version: EM64L-G09RevD.01
frameworkgroup: C1[X(C10H12BrCl2N)]
method: RPBEPBE
basis: SDD
operation: Freq
keyword: #p
keyword: freq=noraman
keyword: PBEPBE/SDD
title: #p freq=noraman PBEPBE/SDD
converged: YES YES NO NO
title: Mulliken charges:
elementType: Br Cl Cl N C C C C C C C C C C H H H H H H H H H H H H
charge: -0.000999 -0.054880 -0.054958 -0.173954 -0.391344 -0.391351 0.463475 -0.583069 -0.583140 -0.351263 -0.351178 -0.191109 -0.191207 -0.241989 0.249840 0.249457 0.249862 0.249469 0.292474 0.269460 0.292502 0.269505 0.239177 0.239213 0.248004 0.248001
chargesum: 0.00000
title: Mulliken charges with hydrogens summed into heavy atoms:
elementType: Br Cl Cl N C C C C C C C C C C
charge: -0.000999 -0.054880 -0.054958 -0.173954 0.107952 0.107981 0.463475 -0.021135 -0.021132 -0.112086 -0.111965 0.056896 0.056793 -0.241989
polarizability: 2.29811516e+02 -1.38510747e-02 1.59566927e+02 -5.77927998e-03 1.75933440e+01 8.03518989e+01
1716.lowfreq: -4.8993 -0.0013 -0.0009 -0.0009 2.3245 10.6482 30.1186 33.4627 39.8835
frequency: 30.0726 33.4514 39.8810 60.2074 90.1339 123.9239 133.2289 173.2221 190.4243 210.5137 243.1524 263.2067 276.5953 325.8778 378.8702 410.8241 440.9754 504.8016 535.4712 580.7472 625.2933 669.9304 692.4867 703.8740 750.3172 786.0471 792.8560 801.9226 810.6181 934.1729 947.7689 955.4730 978.9412 999.7989 1035.1202 1035.3818 1041.0087 1073.3271 1120.5957 1132.1780 1181.6503 1206.7677 1223.1595 1258.5978 1258.7101 1278.3533 1295.0198 1307.2230 1354.5855 1357.8374 1365.7601 1386.1989 1415.1438 1460.5795 1460.8154 1485.3557 1487.2581 1506.8630 1566.5366 1608.5122 3013.6663 3018.4131 3064.0289 3064.3256 3069.7851 3075.7839 3148.2313 3148.8852 3152.0767 3152.2247 3170.3713 3174.7435
redmass: 16.5686 13.1485 10.9549 3.7156 3.8597 3.7096 2.6060 5.3185 17.7362 4.3719 4.3530 5.0555 6.4691 3.9243 5.7412 2.9898 2.8251 2.7645 4.9802 4.4687 7.1632 6.6367 4.5374 3.8459 4.5616 1.1210 1.1690 1.2377 1.6900 1.3152 1.5678 2.2776 4.6968 1.4212 4.5606 1.9140 2.5692 2.3949 1.6147 1.3119 1.6199 1.1202 2.1477 1.1609 1.1588 1.3565 1.1843 1.3436 1.2501 1.4498 5.9021 1.6850 3.3147 1.0913 1.0941 1.0830 2.4446 1.1176 7.2174 6.1089 1.0603 1.0613 1.0572 1.0588 1.1019 1.1031 1.1104 1.1110 1.0890 1.0881 1.0959 1.0968
irintensity: 0.9794 0.5567 1.3607 0.6144 1.2028 1.2518 1.7803 0.1228 0.0092 2.4003 16.4610 1.2228 4.1652 0.9966 22.1978 0.7480 3.6057 20.5176 20.9144 6.3572 0.4722 80.9221 63.8135 29.0218 1.0276 3.1600 10.0632 0.3077 83.2279 0.0935 4.3196 9.3234 24.3175 3.8773 0.4996 0.2031 1.5595 17.7487 31.2975 13.5881 72.3583 21.2085 38.0645 17.8661 13.8454 44.0016 7.3407 5.5222 0.4827 58.1520 0.9516 31.2011 2.0013 17.5661 5.4355 28.3139 297.7567 44.8368 3.3814 108.5849 26.5755 11.5114 5.0753 24.0147 10.3324 11.0157 3.2585 25.1044 3.4527 10.9446 18.0771 3.5724
temp: 298.150 k
press: 1.00000 atm
elementType: 35 17 17 7 6 6 6 6 6 6 6 6 6 6 1 1 1 1 1 1 1 1 1 1 1 1
symmnumber: 1
zpe: 524264.4 jmol-1
zpe.correction: 0.199682 hartree
zpe.thermalcorrener: 0.214543 hartree
zpe.thermalcorrenthalpy: 0.215487 hartree
zpe.thermalcorrgfe: 0.153728 hartree
zpe.sumelectzpe: -1375.533202 hartree
zpe.sumelectthermal: -1375.518340 hartree
zpe.sumelectthermalent: -1375.517396 hartree
zpe.sumelectthermalfe: -1375.579156 hartree
dipole: -1.4752 -0.0007 0.0018
dipole: 1.4752
quadrupole: -121.3800 -118.9994 -106.7599
quadrupole: 0.0036 -0.0113 1.6368
quadrupole: -5.6669 -3.2863 8.9532 0.0036 -0.0113 1.6368
hfenergy: -1375.7328835 hartree
pointgroup: C01 [X(C10H12Br1Cl2N1)]
dipole: -0.5804075 0.0001212 0.0000543 debye
dipolederiv: -0.7948928 -0.0003161 0.0009008 0.0002383 -0.0695379 -0.0101809 0.0009528 -0.0085413 -0.0444032 -0.3698503 0.2621504 0.0192391 0.3523942 -0.617524 -0.0145209 0.08573 -0.1051254 -0.2015313 -0.3696966 -0.2624576 -0.0186872 -0.3521386 -0.6182723 -0.0133428 -0.0848521 -0.1040333 -0.2011519 -1.8255204 0.0001418 0.0020206 -0.0002185 -0.9006964 0.0648309 0.0024879 0.1786597 -0.3116546 0.2851813 -0.2165042 -0.0121922 -0.4249294 0.5213901 0.0298919 -0.0148017 -0.1078463 0.1774544 0.2843995 0.2153709 0.0117871 0.4244634 0.5219114 0.0287854 0.014449 -0.1086195 0.1775974 1.9881893 0.0009223 -0.0027465 0.0010469 -0.1227291 -0.0718996 -0.003065 -0.0873658 0.0899136 0.3825734 -0.3167742 -0.0573338 -0.3608101 0.6503785 0.1052277 -0.1012889 0.2236348 0.1439919 0.3823133 0.3175862 0.0563375 0.3612144 0.651411 0.1039981 0.1000206 0.2225062 0.1432979 -0.434411 0.0303411 0.0322162 -0.3353461 0.0042168 0.0622393 -0.1230096 0.0775053 -0.1878121 -0.4343831 -0.0305405 -0.0314975 0.3352627 0.0046452 0.0612116 0.1237634 0.0775924 -0.1882062 -0.1171472 -0.0488871 -0.0246423 -0.0312005 0.0968624 0.0754271 -0.0190996 0.0584344 -0.0479278 -0.1173267 0.0489695 0.0246769 0.0310575 0.0968549 0.0753348 0.0191088 0.0583304 -0.0480591 1.1769489 0.0004933 -0.0014981 0.0002662 -0.1779761 -0.0143894 -0.0014213 -0.0101565 -0.173157 -0.1120526 -0.0296723 0.0706626 -0.0238496 0.034366 0.0452129 0.0251615 0.0466346 0.0718852 0.0693257 -0.041253 -0.101039 0.0372372 -0.0227056 -0.0629243 -0.055933 -0.0371014 -0.0412517 -0.1123527 0.0298026 -0.0699657 0.023863 0.0344644 0.0448727 -0.0244719 0.046384 0.0723739 0.0698404 0.0411865 0.1007265 -0.0374713 -0.0226811 -0.0627034 0.055505 -0.037201 -0.0420639 -0.0476724 -0.0327405 0.0879085 -0.004728 0.0056908 -0.0119752 0.0671623 -0.0203554 0.0632667 0.005982 0.0333545 -0.0568917 -0.0045279 -0.0150824 -0.1004831 -0.0499637 -0.0540773 -0.0295084 -0.0483141 0.0327944 -0.0872751 0.0047262 0.0058508 -0.0121562 -0.0666031 -0.0208294 0.0640611 0.0065677 -0.0337276 0.0567129 0.0040109 -0.0150046 -0.1004196 0.0498586 -0.0538415 -0.0301296 0.0100642 0.0857279 0.0287459 0.097973 -0.0273475 -0.0552942 0.0362988 -0.0628939 0.1359967 0.0099256 -0.0858405 -0.0284284 -0.0982643 -0.0276177 -0.0550296 -0.0360392 -0.0626005 0.1362285 0.0560917 -0.0643331 -0.0245602 -0.0716819 0.0045252 -0.0557877 -0.0253216 -0.0544957 0.1354429 0.0562169 0.0642053 0.0248231 0.0714123 0.0046074 -0.0559256 0.0253722 -0.0545976 0.1353465 unknown
polarizability: 229.8112391|0.0562134|159.2966439|-0.1990746|18.1896112|80.622459 unknown
InChI: InChI=1S/C10H12BrCl2N/c11-9-1-3-10(4-2-9)14(7-5-12)8-6-13/h1-4H,5-8H2
charge 0 multiplicity 1
26 atoms
Br 5.075621 0.002152 -0.006146
Cl -3.033936 3.700347 0.023113
Cl -3.029066 -3.703278 -0.012826
N  -1.15439 -0.000203 0.0014
C  -1.920464 1.165701 0.473743
C  -1.920808 -1.166925 -0.468393
C  0.259256 0.000492 -0.000929
C  -2.082346 2.210454 -0.647253
C  -2.075471 -2.212454 0.652852
C  1.001112 1.147084 0.420037
C  1.000937 -1.145649 -0.423282
C  2.410494 1.146327 0.422296
C  2.410331 -1.143825 -0.428803
C  3.111492 0.001511 -0.004102
H  -2.92052 0.833025 0.802819
H  -1.438813 1.627753 1.353998
H  -2.922817 -0.835824 -0.793107
H  -1.442122 -1.627698 -1.350853
H  -1.118318 2.601977 -1.001843
H  -2.675809 1.828416 -1.491076
H  -1.108908 -2.602902 1.001734
H  -2.664732 -1.83154 1.500129
H  0.492646 2.057302 0.749595
H  0.492405 -2.056419 -0.751252
H  2.951055 2.038866 0.750953
H  2.950771 -2.036091 -0.758404
