program: Gaussian 09
title: 000262046
version: EM64L-G09RevD.01
frameworkgroup: C1[X(C22H17P)]
method: RPBEPBE
basis: SDD
operation: Freq
keyword: #pfreq=noraman
keyword: PBEPBE/SDD
title: #p freq=noraman PBEPBE/SDD
converged: YES YES NO NO
title: Mulliken charges:
elementType: P C C C C C C C C C C C C C C C C C C C C C C H H H H H H H H H H H H H H H H H
charge: 0.561050 -0.237365 -0.228914 -0.147166 -0.311841 -0.309667 0.448453 0.445754 -0.303735 -0.189215 -0.392188 -0.390441 -0.395753 -0.393409 -0.214236 -0.224501 -0.234747 -0.234975 -0.234671 -0.235147 -0.229231 -0.248288 -0.248290 0.242446 0.242549 0.242103 0.255629 0.227785 0.228279 0.234233 0.232346 0.228866 0.228970 0.224080 0.224149 0.224745 0.224739 0.229920 0.228848 0.228837
chargesum: 0.00000
title: Mulliken charges with hydrogens summed into heavy atoms:
elementType: P C C C C C C C C C C C C C C C C C C C C C C
charge: 0.561050 -0.237365 -0.228914 -0.147166 -0.069395 -0.067118 0.448453 0.445754 -0.061631 0.066414 -0.164403 -0.162162 -0.161520 -0.161064 0.014630 0.004469 -0.010667 -0.010826 -0.009926 -0.010408 0.000690 -0.019440 -0.019453
polarizability: 4.43040288e+02 4.51564763e-01 2.32012715e+02 -1.24638882e+00 -4.06259254e+01 2.00502842e+02
1716.lowfreq: -4.7369 -3.9040 0.0014 0.0016 0.0016 7.0462 15.6692 32.3135 33.1538
frequency: 13.2404 32.3028 33.1525 38.4617 40.6459 60.4065 93.9002 121.5216 152.9610 182.6842 196.4921 213.5103 237.7506 330.9964 333.5288 363.8615 368.0266 398.1053 402.4471 402.8995 433.6643 464.0096 472.4620 496.7033 557.8409 581.7262 588.1938 610.8154 612.5171 615.1221 651.0689 652.5296 679.1233 692.7431 694.1112 694.6565 699.3210 753.9998 770.7971 772.1895 840.5728 844.0374 848.2857 853.6769 900.8580 910.8179 918.6968 919.1285 926.9050 951.8342 973.9798 974.2379 978.7302 985.6072 986.8419 987.0159 991.9340 992.1140 998.4773 1016.9837 1024.6187 1029.3142 1062.4186 1074.4835 1080.9152 1083.1065 1084.3118 1171.9698 1172.1204 1172.5805 1188.3967 1192.6109 1193.5741 1218.2833 1249.3606 1288.9588 1305.1604 1307.5814 1320.2129 1330.0491 1373.9584 1374.1430 1378.1452 1423.7755 1435.4720 1436.2537 1464.0327 1470.6082 1475.8797 1508.6357 1565.4896 1576.1433 1577.6673 1585.2038 1591.6863 1606.8958 1607.7379 3119.5092 3119.7020 3122.8801 3123.7636 3124.7601 3127.4754 3128.6826 3137.9836 3138.2545 3139.5045 3145.8857 3147.8949 3149.0877 3150.1112 3164.2076 3164.2747 3164.5726
redmass: 3.7205 5.4507 5.0807 4.1483 3.7499 5.0746 4.9908 4.8065 4.9782 4.5095 4.5818 6.5318 4.6805 4.3167 7.2315 6.5735 8.4337 2.7833 2.8211 2.8403 4.7859 4.6584 3.4455 3.2113 6.0915 3.2800 4.8000 6.3654 6.4932 6.4295 5.6611 6.9295 7.0336 6.5491 1.7262 1.7080 1.9609 1.6298 1.7652 1.8814 1.3188 1.2590 1.2971 1.2469 4.1901 1.4403 1.5551 1.6025 1.3891 5.9579 1.4199 1.4215 1.4079 5.5270 5.5398 6.1117 1.3266 1.3223 1.3229 3.4447 2.1823 2.0546 1.8004 1.6445 2.3145 1.6206 1.6140 1.0568 1.0554 1.0539 1.1159 1.1252 1.1194 1.7977 2.4546 2.2058 2.0705 1.3946 1.4058 1.5978 8.5607 5.5252 6.3020 2.1032 2.4272 2.4429 2.0747 2.7501 2.2669 5.1755 5.3261 5.7360 6.0615 6.1080 5.9624 5.9929 6.0239 1.0859 1.0859 1.0848 1.0870 1.0864 1.0883 1.0878 1.0916 1.0914 1.0922 1.0972 1.0959 1.0961 1.0967 1.1017 1.1015 1.1015
irintensity: 0.0200 0.2486 0.2364 0.0551 0.0103 0.0025 0.6372 0.0378 0.0002 1.7457 0.2217 0.2415 0.3169 0.5309 1.8269 0.3751 3.8961 0.0104 0.0662 0.1884 1.9523 36.7680 4.7842 0.9094 0.3240 21.4591 1.3484 0.0269 0.0823 0.0605 4.8832 1.2285 0.4473 2.5369 81.8958 15.2418 24.3379 47.6260 159.3444 0.1371 21.4888 1.1291 14.8853 0.0848 7.9203 2.6173 0.9380 6.0165 0.4571 0.0599 0.1244 0.5822 0.1385 1.3113 0.5629 2.8004 0.4441 0.0466 0.0051 7.2965 1.3678 14.8401 2.4718 8.4034 3.8393 0.1733 17.6538 0.0460 0.0135 0.0088 2.6135 0.8524 0.6314 2.7312 3.3077 11.8913 3.7572 5.6959 0.4591 0.1330 0.8610 2.0777 0.4973 12.0531 3.4583 9.0916 13.1813 8.1928 64.6193 1.7660 0.2715 4.5557 0.0423 2.8213 2.1336 0.2938 32.1779 19.2640 3.1219 0.6435 17.0087 0.5139 21.8065 0.7783 2.6158 11.9377 10.6431 9.4435 0.2102 76.3021 35.2988 23.7636 80.9446 5.7980
temp: 298.150 k
press: 1.00000 atm
elementType: 15 6 6 6 6 6 6 6 6 6 6 6 6 6 6 6 6 6 6 6 6 6 6 1 1 1 1 1 1 1 1 1 1 1 1 1 1 1 1 1
symmnumber: 1
zpe: 823518.4 jmol-1
zpe.correction: 0.313662 hartree
zpe.thermalcorrener: 0.332860 hartree
zpe.thermalcorrenthalpy: 0.333804 hartree
zpe.thermalcorrgfe: 0.262809 hartree
zpe.sumelectzpe: -1188.202340 hartree
zpe.sumelectthermal: -1188.183141 hartree
zpe.sumelectthermalent: -1188.182197 hartree
zpe.sumelectthermalfe: -1188.253192 hartree
dipole: -0.0018 1.0175 1.2014
dipole: 1.5744
quadrupole: -129.3643 -132.9380 -132.0169
quadrupole: 0.1647 -0.4712 -10.4522
quadrupole: 2.0754 -1.4983 -0.5772 0.1647 -0.4712 -10.4522
hfenergy: -1188.5160016 hartree
pointgroup: C01 [X(C22H17P1)]
dipole: 0.0557545 -0.4785549 -0.389299 debye
polarizability: 438.7811355|8.1638983|216.6961353|30.7634541|-42.8583443|220.0785743 unknown
InChI: InChI=1S/C22H17P/c1-4-10-18(11-5-1)21-16-17-22(19-12-6-2-7-13-19)23(21)20-14-8-3-9-15-20/h1-17H
charge 0 multiplicity 1
40 atoms
P  -0.110573 0.468171 0.833149
C  -1.301516 1.221438 -0.409615
C  1.335869 1.252848 -0.075623
C  -0.02484 -1.350767 0.326486
C  -0.598307 2.082974 -1.242199
C  0.842759 2.100059 -1.059763
C  -2.748431 0.980446 -0.393698
C  2.73768 1.048456 0.304373
C  -0.073966 -2.334959 1.343099
C  0.083693 -1.745211 -1.029666
C  -3.561187 1.304611 -1.52282
C  3.7993 1.386812 -0.589475
C  -3.387026 0.394918 0.739094
C  3.086212 0.487151 1.568367
C  -0.014608 -3.708362 1.00625
C  0.141078 -3.115924 -1.363999
C  -4.949147 1.066316 -1.509709
C  5.145042 1.185859 -0.226268
C  -4.775586 0.151418 0.748386
C  4.433666 0.280933 1.928019
C  0.09222 -4.099796 -0.347002
C  -5.567163 0.48807 -0.374309
C  5.472833 0.631746 1.035055
H  -1.087124 2.743636 -1.967445
H  1.481711 2.773855 -1.64197
H  -0.159785 -2.03074 2.392801
H  0.120984 -0.982606 -1.815796
H  -3.094846 1.723509 -2.421553
H  3.562874 1.786272 -1.582027
H  -2.786928 0.152926 1.624756
H  2.289602 0.236829 2.27959
H  -0.052898 -4.465244 1.797656
H  0.223712 -3.416076 -2.414673
H  -5.551746 1.32084 -2.389202
H  5.942366 1.450762 -0.930148
H  -5.2420 -0.296196 1.633188
H  4.67429 -0.147656 2.907419
H  0.136785 -5.162915 -0.60926
H  -6.646387 0.299791 -0.367896
H  6.520288 0.47311 1.314129
