program: Gaussian 09
title: 000261978
version: EM64L-G09RevD.01
frameworkgroup: C1[X(C6H12N2O2)]
method: RPBEPBE
basis: SDD
operation: Freq
keyword: #p
keyword: freq=noraman
keyword: PBEPBE/SDD
title: #p freq=noraman PBEPBE/SDD
converged: YES YES NO NO
title: Mulliken charges:
elementType: O O N N C C C C C C H H H H H H H H H H H H
charge: -0.259111 -0.253244 -0.018238 -0.374524 -0.615331 0.231568 -0.606724 -0.622876 0.287238 -0.767805 0.267456 0.262123 0.354532 0.192174 0.272097 0.222759 0.248441 0.194062 0.232584 0.243268 0.249957 0.259593
chargesum: 0.00000
title: Mulliken charges with hydrogens summed into heavy atoms:
elementType: O O N N C C C C C C
charge: -0.259111 -0.253244 -0.018238 -0.019992 -0.085752 0.231568 0.080307 0.052211 0.287238 -0.014986
polarizability: 1.13356594e+02 -4.32852729e+00 9.07675948e+01 1.85170548e+00 -2.98734679e+00 6.23311938e+01
1716.lowfreq: -3.1245 -0.0014 -0.0013 -0.0012 9.1342 13.0754 31.0147 36.5226 78.3823
frequency: 30.9977 36.2840 78.3755 104.3705 128.4896 153.4257 219.1658 225.0371 238.6275 288.9270 345.9814 350.4331 408.9942 441.6958 457.5688 554.1600 569.4051 663.6691 719.8952 816.8870 831.6974 880.2875 930.1604 970.9275 1016.3113 1020.6289 1049.6167 1088.5128 1134.6763 1163.6015 1180.0148 1219.6180 1244.6294 1250.4888 1311.6117 1372.0353 1414.1668 1417.6629 1430.5157 1441.3131 1452.0816 1457.2902 1465.4243 1474.3177 1484.4066 1528.6758 1606.6318 1638.8253 2867.2348 2900.7039 2974.6487 2981.8485 3042.6136 3051.1330 3064.2001 3078.2702 3102.7740 3107.8306 3126.3379 3299.2455
redmass: 2.8203 3.2943 3.9409 3.9498 2.0265 1.3481 2.3962 1.4088 1.0893 3.1364 4.3222 3.0356 3.1236 3.6235 2.2310 3.7738 3.7706 4.3910 1.1294 2.2657 4.6026 2.5443 4.2971 1.7960 1.6952 1.7821 2.5017 1.2435 1.4460 1.4545 1.7389 2.7257 3.9334 2.4086 1.8587 1.2499 1.1432 1.0990 1.1628 1.0740 1.0554 1.0522 1.0572 1.0479 1.0522 1.6664 6.1926 7.1601 1.0564 1.0518 1.0661 1.0392 1.0732 1.0791 1.0953 1.0914 1.1016 1.1019 1.1003 1.0817
irintensity: 4.1568 0.3602 14.1135 3.8901 4.3393 2.1974 10.4582 2.0455 1.4166 1.8760 3.4619 2.9193 0.6917 2.9176 3.1841 22.0750 12.2871 2.0535 85.1574 3.6428 22.0563 5.9415 0.7717 7.5655 11.1023 18.6341 65.1146 5.1564 0.4096 48.6342 5.5277 43.7440 30.2075 8.9496 63.0432 70.5495 11.5716 51.1943 12.2354 19.4377 19.0667 26.8826 9.1524 7.4901 28.1694 167.5786 4.8434 321.1348 103.1574 133.0237 2.0971 1.7675 26.8396 34.1137 8.6566 6.4137 14.6673 24.6629 11.6795 135.0984
temp: 298.150 k
press: 1.00000 atm
elementType: 8 8 7 7 6 6 6 6 6 6 1 1 1 1 1 1 1 1 1 1 1 1
symmnumber: 1
zpe: 471958.9 jmol-1
zpe.correction: 0.179760 hartree
zpe.thermalcorrener: 0.191900 hartree
zpe.thermalcorrenthalpy: 0.192845 hartree
zpe.thermalcorrgfe: 0.140422 hartree
zpe.sumelectzpe: -494.949575 hartree
zpe.sumelectthermal: -494.937434 hartree
zpe.sumelectthermalent: -494.936490 hartree
zpe.sumelectthermalfe: -494.988913 hartree
dipole: -2.0191 -1.9371 1.5078
dipole: 3.1784
quadrupole: -45.1589 -70.3237 -60.9231
quadrupole: -8.9304 3.5502 5.5924
quadrupole: 13.6430 -11.5218 -2.1212 -8.9304 3.5502 5.5924
hfenergy: -495.1293343 hartree
pointgroup: C01 [X(C6H12N2O2)]
dipole: -0.7044732 -0.2841181 0.9933235 debye
dipolederiv: -0.5775719 -0.1509069 0.2305662 0.1321287 -0.6618191 0.3141626 -0.0211322 0.3904005 -0.8005615 -0.8096554 0.0934266 -0.083888 -0.0041104 -0.5983101 0.27746 -0.0157694 0.2535783 -0.5540169 -0.1838352 0.0445589 -0.0865798 -0.0015949 -0.3024558 0.0735411 0.0516503 -0.0185891 -0.3757838 -0.41204 0.0168091 -0.182042 0.1147218 -0.6785163 0.1712143 -0.1128592 0.2021329 -0.3953512 -0.5429681 -0.1744385 0.2597861 -0.1286201 -0.2515688 0.1742434 0.334288 0.0995639 -0.0767317 1.0565776 -0.0797835 -0.2508742 -0.5636735 0.7697493 -0.5462504 0.0514866 -0.6306511 0.9241474 0.202881 0.1599775 0.0735279 0.2505535 0.0844778 0.1384703 0.0263823 0.0852548 0.3377149 0.0216225 -0.0732383 0.0235144 -0.1737309 0.4098971 -0.1432775 0.0722726 -0.1391629 0.4120878 1.1460519 0.1128486 0.1218711 0.3403309 0.6901501 -0.4684952 0.0640902 -0.3891768 0.4452915 -0.5607989 -0.0341285 -0.0851383 -0.0811527 0.0073953 0.033621 -0.2236563 -0.0025548 0.0003175 0.1107474 0.007209 -0.0157886 0.0057532 0.0294395 -0.042224 0.0314062 -0.0715913 0.0284208 -0.0288939 0.00912 -0.0468298 0.0237675 0.1150925 0.0259295 -0.0775971 0.0631462 0.0124949 0.3925304 0.0678682 -0.0508161 0.1093836 0.2612476 0.0295246 -0.1183082 0.0672159 0.2143357 0.0124723 -0.0602724 0.0046531 -0.0773272 0.0350824 -0.0074131 -0.1528557 -0.0958133 -0.2599031 0.1543809 0.0631008 -0.0318486 0.0115188 -0.0706613 0.032073 -0.0199797 0.0569507 0.0649758 -0.1580193 0.0325456 0.0524851 0.0787049 0.0911055 -0.0519856 0.0671789 -0.0479819 0.0612301 0.0365077 -0.1559324 -0.0646367 -0.0814323 -0.0342449 -0.0395028 -0.0774633 -0.0301755 0.047247 0.0816795 0.0086421 0.0255452 0.0484498 -0.039681 -0.0102158 -0.0621575 0.1697662 -0.2713882 -0.1300329 0.1105187 0.0610442 0.0474995 0.0734072 0.0135742 0.069925 0.0127467 0.0693954 0.0780294 0.032416 -0.0035503 0.0638124 -0.0735805 -0.0276561 0.0454058 -0.0139781 0.1288146 0.075443 0.0021605 0.0189444 -0.0332837 0.1138966 -0.0405809 -0.0082786 -0.0501937 -0.0531021 0.0348918 -0.032501 0.0300546 -0.0816989 0.0298968 0.0937872 0.0759716 0.0891124 0.0403651 unknown
polarizability: 113.0056275|-6.4458075|80.7235288|-1.7368916|-13.6204879|72.726226 unknown
InChI: InChI=1S/C6H12N2O2/c1-5(9)4-6(10)7-8(2)3/h7H,4H2,1-3H3
charge 0 multiplicity 1
22 atoms
O  0.600064 1.708481 -1.370505
O  -1.380852 -0.689444 1.622618
N  2.238991 -0.251666 -0.081758
N  0.904503 0.091618 0.304675
C  -1.258877 1.270397 0.156294
C  0.172807 1.021966 -0.395379
C  3.216203 0.782913 0.338932
C  2.558996 -1.621406 0.360287
C  -1.987434 0.137479 0.876983
C  -3.487961 0.049775 0.668094
H  -1.186788 2.120579 0.868442
H  -1.857293 1.638274 -0.694106
H  0.446663 -0.393542 1.098254
H  3.297632 0.888553 1.4466
H  2.913231 1.74645 -0.101128
H  4.204366 0.511734 -0.070709
H  1.835427 -2.328397 -0.078951
H  2.554712 -1.747975 1.472163
H  3.565041 -1.87947 -0.010621
H  -3.964756 1.039066 0.797316
H  -3.697142 -0.26989 -0.371645
H  -3.932435 -0.677895 1.364043
