program: Gaussian 09
title: 000261974
version: EM64L-G09RevD.01
frameworkgroup: C1[X(C10H14N2O4)]
method: RPBEPBE
basis: SDD
operation: Freq
keyword: #p
keyword: freq=noraman
keyword: PBEPBE/SDD
title: #p freq=noraman PBEPBE/SDD
converged: YES YES NO NO
title: Mulliken charges:
elementType: O O O O N N C C C C C C C C C C H H H H H H H H H H H H H H
charge: -0.313125 -0.313521 -0.292567 -0.292672 -0.364079 -0.364041 0.225953 0.226053 0.107281 0.107663 -0.015833 -0.014364 -0.637271 -0.638431 -0.521325 -0.521302 0.349066 0.349105 0.228354 0.227846 0.298881 0.227769 0.299520 0.228976 0.204702 0.277203 0.224048 0.277232 0.224001 0.204878
chargesum: 0.00000
title: Mulliken charges with hydrogens summed into heavy atoms:
elementType: O O O O N N C C C C C C C C C C
charge: -0.313125 -0.313521 -0.292567 -0.292672 -0.015012 -0.014937 0.225953 0.226053 0.107281 0.107663 -0.015833 -0.014364 0.117810 0.117835 0.184627 0.184809
polarizability: 1.90991585e+02 -2.94165022e+01 2.01905445e+02 -5.57484728e-02 -2.97265189e-02 7.72554768e+01
1716.lowfreq: -10.0039 -5.7652 -0.0008 -0.0008 -0.0006 7.5922 37.9995 59.5961 64.9411
frequency: 37.9664 59.5882 64.9300 73.2744 86.6441 101.2097 101.4324 150.4892 161.8131 168.0357 168.9831 194.7004 201.0235 220.0969 261.2829 278.2086 308.8706 322.6868 337.5464 402.1791 408.7317 432.5318 460.3713 461.4880 514.8221 540.9182 607.1053 633.6647 721.7121 797.8096 807.4683 817.0637 827.7545 839.9107 886.3816 944.5847 1003.0539 1015.1733 1089.7492 1093.4288 1109.3375 1109.5974 1118.5732 1118.8533 1158.9060 1159.1530 1170.6658 1179.3860 1263.9435 1273.5617 1310.5430 1320.1026 1414.7118 1415.3630 1432.1917 1436.1613 1450.3442 1450.5717 1462.4072 1463.9658 1487.3675 1488.0939 1490.3812 1491.8434 1501.8707 1502.5724 1558.7232 1565.7369 1634.0143 1636.3048 2968.5152 2968.9730 2970.6394 2971.8392 3046.7766 3048.7412 3082.1891 3082.3114 3124.6289 3124.7034 3140.6767 3140.8517 3323.7034 3330.4862
redmass: 2.4816 1.6907 2.1499 3.1092 2.6559 1.4893 1.4529 2.0606 2.7239 2.1115 1.4795 3.7274 2.7992 3.6970 4.2243 5.1637 5.2067 7.0821 6.4317 8.4365 5.1959 7.0540 7.1433 5.1116 9.1345 6.0564 5.9140 9.3130 10.4432 2.7195 6.6420 1.1154 2.8390 2.3830 7.4592 4.6483 3.3743 4.8436 4.9141 4.5840 1.2729 1.2713 1.2977 1.2965 1.4921 1.4979 1.8995 1.8491 2.5048 3.0814 6.5566 6.9938 1.2016 1.1661 1.1858 1.1889 1.0673 1.0655 1.1548 1.1063 1.0980 1.0673 1.2214 1.0908 2.2772 2.1764 2.1415 2.4599 8.7716 8.6255 1.0371 1.0361 1.0388 1.0385 1.0979 1.0966 1.0966 1.0966 1.1051 1.1051 1.0977 1.0976 1.0743 1.0752
irintensity: 2.4250 0.5830 0.1859 8.7056 4.5747 1.4759 3.0250 0.0088 0.7091 0.3527 0.5562 1.0927 0.7204 11.4547 4.1636 0.0844 1.7640 2.6100 0.1919 24.6654 36.5327 0.7782 0.8631 13.8263 0.5769 0.8525 4.3458 6.6571 5.1693 3.9927 1.0362 183.4181 12.1704 6.2611 20.1635 107.9786 4.8449 104.5385 8.4411 180.9509 9.6965 3.0587 6.1216 5.7601 2.9212 37.8088 1.9395 52.6025 0.0220 157.2527 49.4781 1.1008 145.6433 2.3137 53.2551 2.1097 50.1290 6.9153 18.6303 36.6286 83.2381 5.7723 16.9093 30.4631 2.3044 608.8031 0.3405 101.2861 353.1711 4.2552 55.3966 52.1862 161.4621 69.4235 31.8685 34.4099 52.1567 21.2847 16.2253 9.9299 0.7803 1.0303 0.9624 211.4528
temp: 298.150 k
press: 1.00000 atm
elementType: 8 8 8 8 7 7 6 6 6 6 6 6 6 6 6 6 1 1 1 1 1 1 1 1 1 1 1 1 1 1
symmnumber: 1
zpe: 616704.7 jmol-1
zpe.correction: 0.234890 hartree
zpe.thermalcorrener: 0.252569 hartree
zpe.thermalcorrenthalpy: 0.253513 hartree
zpe.thermalcorrgfe: 0.188955 hartree
zpe.sumelectzpe: -798.596694 hartree
zpe.sumelectthermal: -798.579015 hartree
zpe.sumelectthermalent: -798.578071 hartree
zpe.sumelectthermalfe: -798.642629 hartree
dipole: -0.0084 0.0042 2.6225
dipole: 2.6225
quadrupole: -73.3620 -96.8434 -94.5207
quadrupole: -11.0544 -0.0409 0.0607
quadrupole: 14.8800 -8.6014 -6.2786 -11.0544 -0.0409 0.0607
hfenergy: -798.831584 hartree
pointgroup: C01 [X(C10H14N2O4)]
dipole: 0.0170119 -0.0723897 1.0290962 debye
polarizability: 194.0967059|-29.6513709|198.1487305|-3.5352029|8.7551964|77.9070702 unknown
InChI: InChI=1S/C10H14N2O4/c1-11-5-7(13)10(16-4)6(12-2)8(14)9(5)15-3/h11-12H,1-4H3
charge 0 multiplicity 1
30 atoms
O  2.66962 1.138925 -0.146665
O  -2.62183 -1.21139 -0.231864
O  0.244043 2.693019 -0.017209
O  -0.196401 -2.7624 -0.396582
N  2.204224 -1.772817 -0.320444
N  -2.155491 1.698259 -0.01675
C  1.233802 -0.826345 -0.208191
C  -1.184499 0.746897 -0.063669
C  1.376512 0.564501 -0.091207
C  -1.326442 -0.646957 -0.137514
C  0.207685 1.402662 -0.06015
C  -0.158876 -1.478792 -0.258495
C  3.663005 -1.630921 -0.332707
C  -3.614637 1.559111 -0.026034
C  3.000452 2.117403 0.915773
C  -2.919098 -2.330684 0.692778
H  1.789597 -2.718871 -0.405664
H  -1.741066 2.647575 0.020241
H  4.086511 -2.254943 -1.140689
H  4.099664 -1.968761 0.628149
H  3.931654 -0.579237 -0.494654
H  -4.038001 1.796493 0.969933
H  -3.886423 0.530223 -0.294017
H  -4.047987 2.263302 -0.759944
H  2.905148 1.651808 1.916531
H  2.341366 2.996845 0.840248
H  4.048716 2.397467 0.727999
H  -2.268235 -3.190693 0.468527
H  -3.975262 -2.580481 0.506563
H  -2.78395 -2.012498 1.745306
