program: Gaussian 09
title: 000261988
version: EM64L-G09RevD.01
frameworkgroup: C1[X(C17H29FO2)]
method: RPBEPBE
basis: SDD
operation: Freq
keyword: #p
keyword: freq=noraman
keyword: PBEPBE/SDD
title: #p freq=noraman PBEPBE/SDD
converged: YES YES NO NO
title: Mulliken charges:
elementType: F O O C C C C C C C C C C C C C C C C C H H H H H H H H H H H H H H H H H H H H H H H H H H H H H
charge: -0.231575 -0.279060 -0.265545 0.002257 -0.429983 -0.429166 -0.483601 -0.746241 -0.460101 -0.134877 0.474624 -0.304221 0.381243 -0.832544 -0.481298 -0.792653 -0.790096 0.235942 -0.263492 -0.666972 0.221478 0.237322 0.190935 0.193208 0.202058 0.232092 0.243264 0.213030 0.214407 0.213838 0.202306 0.205505 0.209595 0.211554 0.258544 0.290981 0.228095 0.251087 0.220756 0.232360 0.215667 0.216481 0.214651 0.226908 0.223184 0.234350 0.223950 0.252805 0.216947
chargesum: 0.00000
title: Mulliken charges with hydrogens summed into heavy atoms:
elementType: F O O C C C C C C C C C C C C C C C C C
charge: -0.231575 -0.279060 -0.265545 0.223734 -0.001726 -0.033899 -0.008245 -0.104966 -0.052289 0.074718 0.474624 -0.092667 0.381243 -0.054924 -0.230211 -0.123869 -0.132056 0.235942 0.194042 0.026729
polarizability: 2.33507965e+02 3.18406166e+01 1.90682957e+02 -1.00927885e+01 -8.92806199e+00 1.61631056e+02
1716.lowfreq: -9.7997 -6.7497 -0.0005 0.0005 0.0007 5.1620 12.2050 18.0722 26.6889
frequency: 10.4689 16.7840 26.5459 30.7381 36.4646 53.1324 62.5106 71.2380 82.9920 97.0562 102.5578 109.9471 128.1625 146.2679 165.1198 177.0629 186.2576 215.7616 222.7290 232.3140 233.7111 273.0298 280.1047 298.1251 301.6147 311.9672 334.7121 358.2743 371.3796 389.8870 407.6676 440.5415 444.9067 485.9045 523.0647 533.5349 574.2102 597.9476 676.5396 698.3936 742.1349 755.4229 786.6716 798.4102 808.2673 828.2544 846.4923 871.8057 884.4740 903.0654 909.4208 934.7280 944.4522 951.9461 968.4251 979.1618 994.3157 1009.1947 1011.3499 1027.3281 1038.3568 1041.3254 1058.9693 1080.4766 1086.5713 1093.9835 1104.2311 1120.6880 1126.9701 1145.5614 1156.5786 1171.1503 1190.8295 1218.1594 1227.2214 1232.3057 1256.2155 1279.3569 1280.1738 1296.6470 1306.1526 1313.6878 1334.9761 1337.6552 1352.5801 1354.1069 1362.4991 1364.0151 1376.7892 1386.2015 1389.1724 1393.0827 1397.4181 1398.5299 1453.8690 1455.6804 1456.8098 1457.8212 1462.4787 1463.6923 1466.2760 1470.1991 1471.1910 1474.5465 1475.4548 1482.5894 1485.2229 1486.8959 1490.6544 1613.1340 1656.9948 1693.5015 2950.4474 2955.4219 2958.3985 2961.5921 2967.0275 2970.4661 2974.0080 2975.3249 2991.5183 3006.0656 3010.6137 3020.6443 3025.5475 3027.2133 3028.7073 3029.2238 3032.2487 3055.6402 3060.9223 3064.1417 3065.8574 3071.4258 3077.8641 3086.3974 3091.5607 3093.5422 3117.4119 3132.2498 3137.2587
redmass: 3.9547 3.8350 4.1594 2.8774 4.1232 3.0733 3.3579 3.8915 1.9226 1.5699 3.4445 1.0571 3.4778 3.1810 1.2606 2.7713 3.5313 1.3906 1.4332 1.4863 2.0732 5.4125 2.6959 2.4500 2.3695 2.9024 3.2891 3.6751 2.3578 2.1998 4.3154 2.5561 3.2273 2.2892 2.9563 2.4686 2.6377 2.9348 3.9401 5.2579 2.0742 1.6079 2.5987 1.7209 1.4128 1.4811 3.4079 1.7766 2.9161 1.7019 2.7165 2.5577 1.4219 1.5917 2.0508 1.8507 1.2549 1.9808 2.1143 2.4255 1.8065 1.5759 2.1557 1.6755 1.7960 2.1841 2.2567 2.3696 2.3546 1.8407 1.6748 1.5034 1.4760 1.9929 1.5805 1.8690 1.2701 1.1408 1.1158 1.3048 1.2728 1.3710 1.6794 1.4565 1.2509 1.5022 1.4375 1.4079 1.3101 1.2881 1.2321 1.2191 1.2302 1.4166 1.0541 1.1067 1.0751 1.0825 1.0531 1.0490 1.0642 1.0479 1.0774 1.0688 1.0613 1.0649 1.0525 1.0710 1.0766 8.2414 6.5334 6.5501 1.0646 1.0374 1.0725 1.0395 1.0580 1.0485 1.0648 1.0436 1.0358 1.0638 1.0950 1.0871 1.0969 1.0943 1.0953 1.0599 1.0932 1.0900 1.0904 1.0985 1.0993 1.1023 1.0974 1.0976 1.1027 1.0952 1.1060 1.0979 1.0908
irintensity: 0.1547 0.0685 0.0861 0.1692 0.4308 0.0614 2.9118 1.0103 1.0265 0.5158 0.0529 0.2675 0.6465 0.5585 2.0002 1.7539 3.1128 1.1646 1.8370 0.8795 0.4452 0.2134 3.6655 0.2919 0.5594 12.2571 6.1173 7.3353 1.7698 0.8341 15.5359 4.0142 2.2530 3.6877 0.3698 0.4381 12.3213 6.0441 5.0410 4.8179 6.3988 5.2971 2.0573 17.4173 4.6456 7.9041 2.0006 1.8539 93.7890 14.6703 12.6018 18.1054 4.5362 6.2191 5.5256 2.1393 4.2149 0.8374 1.5825 119.4090 52.3952 2.5323 15.1889 3.6371 6.3044 68.8739 116.6914 87.0762 42.2203 5.5848 10.7198 3.0948 7.2835 53.3901 4.5518 32.2929 8.9155 3.6778 5.5326 3.0207 13.8939 0.9483 4.2116 11.3924 6.1954 1.8532 2.9487 2.0765 40.4370 24.3415 21.3797 21.2758 9.7268 26.3124 1.6740 43.2426 4.8097 20.3570 2.6801 13.0326 26.3734 17.3867 18.0565 10.0302 8.0101 8.6134 14.8696 6.3506 15.6750 118.1133 98.1826 3.5059 17.2631 39.9710 15.1965 60.6881 30.5678 56.3395 13.3944 13.3805 19.7968 9.0629 30.8658 25.3186 0.6498 41.4330 45.8842 36.2100 42.0022 13.5334 19.9391 61.4408 45.5394 50.4954 49.0885 44.8830 4.2302 34.3589 34.5601 1.3259 5.5113
temp: 298.150 k
press: 1.00000 atm
elementType: 9 8 8 6 6 6 6 6 6 6 6 6 6 6 6 6 6 6 6 6 1 1 1 1 1 1 1 1 1 1 1 1 1 1 1 1 1 1 1 1 1 1 1 1 1 1 1 1 1
symmnumber: 1
zpe: 1111889.1 jmol-1
zpe.correction: 0.423496 hartree
zpe.thermalcorrener: 0.448740 hartree
zpe.thermalcorrenthalpy: 0.449684 hartree
zpe.thermalcorrgfe: 0.364300 hartree
zpe.sumelectzpe: -913.876297 hartree
zpe.sumelectthermal: -913.851054 hartree
zpe.sumelectthermalent: -913.850110 hartree
zpe.sumelectthermalfe: -913.935493 hartree
dipole: -0.2517 2.5691 -1.7126
dipole: 3.0978
quadrupole: -113.8189 -133.6412 -124.5779
quadrupole: 3.9445 -4.7199 0.1828
quadrupole: 10.1938 -9.6285 -0.5653 3.9445 -4.7199 0.1828
hfenergy: -914.2997934 hartree
pointgroup: C01 [X(C17H29F1O2)]
dipole: 0.1627255 -0.7997516 -0.9051634 debye
polarizability: 225.251556|35.8610957|195.1357343|10.5434175|14.5282365|165.4346875 unknown
InChI: InChI=1S/C17H29FO2/c1-6-20-17(19)12-15(5)16(18)11-10-14(4)9-7-8-13(2)3/h8,12,14,16H,6-7,9-11H2,1-5H3
charge 0 multiplicity 1
49 atoms
F  0.158165 4.138666 1.199253
O  -3.7216 0.212281 -0.573148
O  -2.995993 -0.173711 1.616006
C  3.072893 0.659178 -1.010429
C  1.659522 1.29267 -0.866745
C  3.572333 -0.041448 0.283195
C  1.548562 2.412531 0.196505
C  4.121204 1.683882 -1.506364
C  2.640717 -1.153972 0.839779
C  0.109324 2.938957 0.328866
C  -0.875867 1.957394 0.948778
C  2.429085 -2.293321 -0.139484
C  1.263943 -2.917706 -0.479489
C  -0.65684 1.608379 2.401392
C  -1.86004 1.451731 0.14174
C  -0.103364 -2.569141 0.08342
C  1.259804 -4.063819 -1.480436
C  -2.864926 0.435207 0.521338
C  -4.793691 -0.808162 -0.376342
C  -4.273232 -2.211058 -0.705455
H  2.973042 -0.12844 -1.787054
H  0.929165 0.492406 -0.639691
H  1.362924 1.706206 -1.85356
H  4.56536 -0.488039 0.067433
H  3.746699 0.715271 1.075465
H  1.898068 2.056824 1.182814
H  2.185235 3.271987 -0.083645
H  3.782871 2.190639 -2.429895
H  5.08392 1.186216 -1.727285
H  4.320024 2.462888 -0.746007
H  1.673991 -0.718831 1.154602
H  3.109638 -1.552737 1.765099
H  -0.259559 3.300015 -0.650386
H  3.355143 -2.65726 -0.61553
H  -0.514727 2.535177 2.985674
H  -1.493696 1.024862 2.80874
H  0.269178 1.011175 2.52338
H  -1.948556 1.802115 -0.89337
H  -0.532311 -3.436634 0.624035
H  -0.088483 -1.718918 0.784211
H  -0.812462 -2.325855 -0.7334
H  0.861118 -4.99102 -1.021877
H  0.606089 -3.834519 -2.346022
H  2.272693 -4.279699 -1.862927
H  -5.587919 -0.488303 -1.069835
H  -5.149793 -0.749426 0.667218
H  -3.863311 -2.248118 -1.729765
H  -3.488007 -2.513861 0.007532
H  -5.101031 -2.941259 -0.637635
