program: Gaussian 09
title: 000261972
version: EM64L-G09RevD.01
frameworkgroup: C1[X(C14H22N2O4)]
method: RPBEPBE
basis: SDD
operation: Freq
keyword: #p
keyword: freq=noraman
keyword: PBEPBE/SDD
title: #p freq=noraman PBEPBE/SDD
converged: YES YES NO NO
title: Mulliken charges:
elementType: O O O O N N C C C C C C C C C C C C C C H H H H H H H H H H H H H H H H H H H H H H
charge: -0.307215 -0.307262 -0.288587 -0.288587 -0.370810 -0.370800 0.217373 0.217475 -0.326248 -0.326235 0.098809 0.098780 -0.028992 -0.028897 -0.385174 -0.385185 -0.675899 -0.675902 -0.521370 -0.521332 0.267354 0.206238 0.206226 0.267388 0.340907 0.340904 0.198485 0.220522 0.220521 0.198477 0.210711 0.216413 0.224108 0.216412 0.210708 0.224110 0.275594 0.204718 0.222988 0.275540 0.223003 0.204731
chargesum: 0.00000
title: Mulliken charges with hydrogens summed into heavy atoms:
elementType: O O O O N N C C C C C C C C C C C C C C
charge: -0.307215 -0.307262 -0.288587 -0.288587 -0.029903 -0.029896 0.217373 0.217475 0.147344 0.147380 0.098809 0.098780 -0.028992 -0.028897 0.033833 0.033813 -0.024667 -0.024673 0.181930 0.181943
polarizability: 2.96195368e+02 -2.64493801e+01 2.12016824e+02 -1.36809777e+01 5.88246886e+00 1.13032963e+02
1716.lowfreq: -8.9029 -1.3282 -0.0007 -0.0001 0.0005 5.7640 18.4967 28.3182 42.8927
frequency: 18.4967 26.5253 42.8927 52.6481 60.0527 66.7411 76.7243 77.2877 98.8159 103.6329 116.0215 154.5076 167.6215 176.9481 179.5816 193.1604 210.4913 219.4691 220.6466 235.5694 253.3477 266.1626 277.8915 320.0523 323.5236 358.3217 372.1009 424.8301 439.5813 448.2009 460.8914 478.4929 520.6725 590.0402 619.0328 657.3404 720.8881 748.2842 748.9220 786.0631 787.1681 793.7134 815.4328 832.9565 876.0626 877.5803 891.0497 902.8389 911.0406 971.3681 1025.9276 1029.4490 1054.1815 1066.4722 1091.6763 1095.4770 1108.9295 1109.5109 1125.7496 1126.1963 1156.2679 1157.6452 1159.1169 1161.9795 1240.8804 1241.2652 1251.3863 1262.6063 1285.2448 1286.1897 1305.4971 1310.9250 1313.9092 1322.7226 1360.5598 1365.1392 1395.3043 1395.3447 1423.8547 1424.2654 1450.6130 1450.7909 1471.5076 1473.0343 1476.5928 1479.0672 1479.4068 1480.3283 1484.3715 1487.7204 1488.8458 1489.1368 1494.8831 1496.6363 1545.6174 1557.4792 1621.4103 1625.4421 2946.2727 2946.3159 2968.6678 2969.1046 2974.5058 2974.5346 2980.2155 2980.2868 3031.3131 3031.3320 3074.6868 3074.7108 3080.3939 3080.4389 3083.4855 3083.5044 3097.7207 3097.7804 3122.8535 3122.8982 3320.8886 3327.0719
redmass: 3.8217 3.0007 1.8811 2.0059 3.6648 2.7740 2.8430 3.1171 2.7723 3.3113 3.1618 1.5165 1.3667 2.4045 3.1721 3.3267 3.9825 1.1513 1.1276 3.5537 3.2125 5.6959 3.6919 7.2357 5.8954 8.0672 4.5911 8.5767 6.6680 5.9181 3.6112 5.2831 8.6667 6.7714 9.1846 7.4845 11.0748 1.0983 1.0911 1.6433 1.1331 4.4311 3.1323 5.7294 1.3470 1.2073 4.4474 1.8375 1.7763 6.9281 4.3158 4.3652 3.2872 2.8390 4.6363 3.1993 1.2590 1.3036 2.1027 2.0925 1.7367 1.8005 1.6178 1.6559 1.2536 1.2461 2.1545 2.4801 1.1690 1.1253 1.9258 4.5875 1.4927 2.2449 1.4970 1.5543 1.2089 1.2099 1.2177 1.1945 1.0748 1.0662 1.1706 1.0651 1.2706 1.0618 1.0467 1.0829 1.2601 1.1282 1.1100 1.9238 1.2984 1.2448 2.4752 3.0027 11.0624 10.9705 1.0711 1.0711 1.0345 1.0347 1.0619 1.0620 1.0363 1.0364 1.0981 1.0981 1.0998 1.0998 1.0972 1.0973 1.0994 1.0994 1.0923 1.0923 1.1049 1.1049 1.0740 1.0749
irintensity: 0.7826 0.0000 1.6492 0.0000 1.6044 1.1957 0.0021 2.2111 0.0001 12.6672 0.0000 0.7604 0.0000 1.6165 0.0000 0.9579 0.0000 0.0000 0.0971 0.0000 3.3302 13.5069 0.0000 0.0001 24.1431 0.0000 4.6796 6.6505 0.0000 0.0000 43.5790 0.0000 0.0000 0.0000 10.4658 18.6022 3.6136 0.0008 17.0819 0.0072 145.8555 0.0000 0.0000 42.4142 0.0001 11.6051 0.0000 10.7659 0.0000 134.0703 0.0002 82.8801 23.4453 0.0000 0.0001 116.1768 0.0090 5.5790 0.0003 11.3987 62.8575 0.0005 0.0004 8.2304 0.0058 47.4287 0.0000 143.8663 0.0000 11.8520 0.0001 35.9444 46.5785 0.0001 75.7391 0.0001 30.5579 0.0000 0.0019 46.3128 77.7101 0.0992 268.8203 0.0002 281.8619 0.0008 20.7109 0.0017 299.6222 0.0583 120.7809 0.3148 0.0027 91.9116 0.0000 148.0026 419.4826 0.0018 72.2834 0.2070 166.5026 0.0409 0.1984 68.3256 72.3290 0.0524 0.0050 26.3394 0.1878 95.1720 16.6085 56.5770 84.3215 4.0817 20.9191 14.2850 19.4126 9.4141 0.0000 172.9127
temp: 298.150 k
press: 1.00000 atm
elementType: 8 8 8 8 7 7 6 6 6 6 6 6 6 6 6 6 6 6 6 6 1 1 1 1 1 1 1 1 1 1 1 1 1 1 1 1 1 1 1 1 1 1
symmnumber: 1
zpe: 909444.4 jmol-1
zpe.correction: 0.346389 hartree
zpe.thermalcorrener: 0.369607 hartree
zpe.thermalcorrenthalpy: 0.370551 hartree
zpe.thermalcorrgfe: 0.291646 hartree
zpe.sumelectzpe: -955.495828 hartree
zpe.sumelectthermal: -955.472611 hartree
zpe.sumelectthermalent: -955.471666 hartree
zpe.sumelectthermalfe: -955.550571 hartree
dipole: -0.0008 -0.0006 0.0015
dipole: 0.0018
quadrupole: -89.9611 -124.8393 -121.5305
quadrupole: 1.9027 -4.9247 -9.6588
quadrupole: 22.1492 -12.7290 -9.4202 1.9027 -4.9247 -9.6588
hfenergy: -955.842217 hartree
pointgroup: C01 [X(C14H22N2O4)]
dipole: -0.0002918 -0.0002501 0.0006101 debye
polarizability: 295.1101455|-27.4346483|212.7135187|-16.0806873|6.2447816|113.4214905 unknown
InChI: InChI=1S/C14H22N2O4/c1-5-7-15-9-11(17)14(20-4)10(16-8-6-2)12(18)13(9)19-3/h15-16H,5-8H2,1-4H3
charge 0 multiplicity 1
42 atoms
O  2.02069 2.056571 0.256383
O  -2.020806 -2.054715 -0.267855
O  -0.806708 2.573279 0.511204
O  0.80685 -2.571418 -0.52322
N  2.668916 -0.763328 -0.286403
N  -2.668894 0.764926 0.274869
C  1.411805 -0.264358 -0.149642
C  -1.411752 0.266125 0.13787
C  3.969932 -0.073877 -0.282495
C  -3.969746 0.075172 0.271395
C  1.025794 1.064802 0.078144
C  -1.025756 -1.063026 -0.089909
C  -0.36606 1.38756 0.251458
C  0.366093 -1.385713 -0.263592
C  5.087951 -1.033966 0.17458
C  -5.088104 1.034921 -0.185556
C  6.473871 -0.357944 0.118177
C  -6.473847 0.35857 -0.128737
C  1.876463 3.280075 -0.566582
C  -1.877062 -3.277983 0.555566
H  3.903792 0.808224 0.372178
H  4.199869 0.298409 -1.304461
H  -4.199337 -0.297022 1.293471
H  -3.903562 -0.80702 -0.383162
H  2.651714 -1.782509 -0.475465
H  -2.651828 1.784137 0.463806
H  5.089835 -1.937261 -0.469938
H  4.873436 -1.376322 1.205166
H  -4.873915 1.377191 -1.216238
H  -5.090056 1.938302 0.458842
H  6.718696 -0.033462 -0.910613
H  6.508858 0.533841 0.771094
H  7.266627 -1.051078 0.45089
H  -6.508774 -0.533303 -0.781539
H  -6.718344 0.03415 0.90015
H  -7.26685 1.051471 -0.461342
H  0.954284 3.816555 -0.291023
H  1.863182 3.024549 -1.644484
H  2.765447 3.886669 -0.333503
H  -0.955045 -3.814882 0.280316
H  -2.766237 -3.884349 0.322621
H  -1.863817 -3.022063 1.633376
